##TITLE= Raman spectrum of Actinolite (no. 5835) � http://rdrs.uaic.ro
##MINERAL= Actinolite
##CHEMISTRY= Ca2(Mg,Fe++)5Si8O22(OH)2
##JCAMP-DX= 5.01
##DATA TYPE= RAMAN SPECTRUM
##DATA CLASS= XYDATA
##ORIGIN= Department of Geology, UAIC, Romania
##OWNER= http://rdrs.uaic.ro � stud. Apopei Andrei Ionut
##LONGDATE= 2010/10/09 13:37:56.0516 +0200 $$ export date from JSpecView
##SPECTROGRAPHDATASYSTEM= HE 532 (Horiba Jobin-Yvon)
##XUNITS= Raman shift (1/cm)
##YUNITS= Intensity (cnt)
##XFACTOR= 3.188909E-3
##YFACTOR= 5.86068631E-4
##FIRSTX= 3399.61
##FIRSTY= 0
##LASTX= 210.701
##NPOINTS= 1024
##XYDATA= (X++(Y..Y))
1066073@J368P19P53K098j010J255K861l411o33l94q6j225J224k45o20j416j155a151
1051341A77j325O00j255O80O11R09j664J421q67P05M5k745J537K174J662P52l869d63
1036486a65L77K529l207Q79r19J255J529J75J40l649K794k158K623K192k260N98D391
1022299E103k360l34n62j847K763Q62j198r36J637o63O47k074j402K399o73k18H80
1008003G53K014l542K423q89n25j94o05L75M052k023k894K81Q16J671k553J864B022
993597h60j346K13K001j311L05O6J45J136j834N78Q97M99l43J307k198m46j549i32
978266b561J217J956K73j276j982J843l097M428K27l575K105j71R10k185J832A879
964443d54L187q20q19j422m67r90J674K853j782R85l865J030K396j463j702L238i65
$$ y = [0, 1368, 2087, 2840, 4938, 3928, 5183, 8044, 4633, 4000, 3606, 3520, 2295, 3519, 3274, 2654, 1238, 83, -1151, 177, -1148, -548, -1803, -1123, -512, 397, -1267, 154, -713, -8, 37, -2708, -1171, 1003, 2665, 3417, -452, -463, -165, 212, 2741, -466, 413, -506, 749, 2278, 2453, 2593, -1056, 1738, -420, 2203, 4395, 2135, 2733, 4391, 5103, 2743, 2409, 1847, 0, 2763, 3625, 2427, 1491, 3128, 2465, 3112, 1038, -364, 2035, 1362, 1144, 880, 753, 2767, -775, 1648, 759, 234, 40, -565, -190, 3862, 1839, -1055, -774, 42, 1713, -840, 1024, 2022, -860, -2206, -1993, 8, -1303, -998, -932, -787, 349, -1485, -907, -10, 489, 146, 1453, -745, -1191, -2740, -932, -2561, -1344, 612, 885, -391, -2373, -530, -3627, 801, 1028, -2547, -442, -613, 297, -1888, -56, 1879, -454, 2733, 1913, 1094, -328, -795, -1785, -111, 2742, 960, 1945, -1920, -890, 1506, 43, -1659, 1579, -965]
949692A9J280J7L01k795K032j168L93m28m95O19N98n65k624L523m85j884J803a72
934000G32k761J394j236J177m39K862k9p92j452J257J052m344L454k636J746R84E30
919010e70j532J303J279o21J644O19k466L92K281j236o79J985j133r18K008k87B247
903905B867j587J65l932K544J42P00j531K430r85o21J713m96r06J87j66p5J473A357
887830C592k238L020k022j544l72r98K132qk47N72q62N15m98J665K370k046j193B535
871621B434l071K893J356j694J50j615J686m09k685L08K243M68o83r90K026k105G2
856139a79K504J02N6J183k301j310O81j663P15K183K72j733R99l986M18K740J204e77
839663H0J407J533k872n0K011j746L182o99j484j724K157l978K567J486o3j065A021
$$ y = [19, 1299, 1316, 1617, -1178, 854, -314, 79, -349, -844, -225, 373, -192, -2816, 707, 222, -1662, 141, -172, 732, -2029, -635, -1871, -694, -1133, 1729, 1700, 908, -544, 713, 1765, -2579, 875, -1761, -15, 969, 530, -570, -2102, -799, 480, -141, 1503, 2122, -344, 48, 2329, 1093, 414, 2399, 1266, 348, 2356, 2069, 2247, 2867, 1280, 1445, -2487, 57, 199, 899, -632, 1798, 813, 192, 1905, 1409, 503, 690, 524, 449, 1922, 1357, 3592, 1354, 4374, 2352, 808, 436, -562, 1570, 1562, 1315, 1887, 1025, 1540, 1042, 2707, 5077, 3031, 1838, 2535, 2434, -637, 2256, 3612, 1918, 2068, 453, 2139, 1730, -955, -647, 1596, 2064, 1381, 391, 2417, 312, 72, -179, 2325, 2427, 2483, 3666, 1365, 55, 736, -927, -212, 1971, 2243, 510, 1509, -2477, -2059, 681, 1885, -577, 80, 1487, 3020, 148, 98, 2109, 363, 3545, 2846, 1362, -362, 1795, -2183, 384, 1870, 1807, 742, 1021]
823931F50q72N97K736J27K650k574l724P95R66P94N77k36k832J573L78k775K267a76
807185A55O96k50J208j48l596M827l541M21K174J001O25k687J399j561m91q44E7
791192B195Q8m80K13j665K569l213Q16J373M1J043j256J179m49J156l546J748c00
775071B949p12k237J935j935J497j667M548o66J496n19j33k637J63Q35l2j147a663
758821I90M45R35p74o7j025J502K50l43O82J773k665k211K865O00l453R30n28c1
741526A000J372p35M26K418j760L00j066j556K211j068M760l196J253j433o83C701
725925B517l973r57j162K764o96N256l565J317p2l006N22k142M460L50l179J648D54
709280a211K124j529L25K340j530l068O32M149j760J860k044k125M295m606O63g87
$$ y = [650, -222, 375, 3111, 3238, 5888, 3314, -410, 385, 1351, 2145, 2722, 2486, -346, 1227, 1605, -1170, 1097, -176, 155, 851, 601, 1809, 1661, -1935, 2892, -649, -228, 1946, 2947, 3572, 885, 2284, 723, 232, -612, 57, 2195, 2283, 1803, 2016, 351, 2920, -293, 523, 1896, 1937, 2980, 1724, 2903, 2454, 3610, 64, 1812, -300, 2949, 2237, 0, 1935, 0, 1497, -170, 4378, 3712, 5208, 4689, 4556, 1919, 2082, 2917, 2885, 1738, -1663, 990, 1435, 2370, 1596, 1529, 504, 2006, 2256, 1913, 2595, 4368, 1703, -508, 2357, 2957, -496, 434, -94, -31, 1000, 2372, 1637, 2063, 4481, 2721, 3021, 1955, 399, 2610, 1542, 6302, 3106, 4359, 2926, 2243, 3701, 2517, -1456, -2413, -3575, -811, -1507, 3749, 184, 1501, 1429, -1577, -1055, -3197, 1263, 1613, -1566, 82, 454, -1211, 913, -616, -291, 2049, 519, -2549, -1917, 2232, 472, 2332, 288, -1837, 2458, -2148, -1485, -787]
693438A082r1r68r68k187J854o62p31L765n38j529l12L923l818L48J20j726J975b541
675585I2k170K416k125J971o80P41J687J83N11o932L961R0J855m79L311m817p19a880
657582C36M778n717r94Q03R64R62Q49j656q5l02k739M83j213O344k205J369j092c083
639426B044k317j828K179J598l49J176m151K224j818L065k535M544o667M641J158C244
623047C649n788k11l160Q747k80m856K304Q35k797J369J961k138k980K461M372A20
606543E016l516Q08l813O895j875k718l39k320R46N14JK05M974J058l860L75j015g9
587947B72M539l078J658n468k942K875j430J815N525l957k955L316m28p24L56A644
571173D152l832k751K587k01n20O10K215k110N562m398N77j403J647J340l475B619
$$ y = [1082, 991, 23, -945, -3132, -1278, -1940, -2671, 1094, 556, -973, -1285, 2638, -1180, -832, -712, -2438, -463, -2541, 92, -2078, 338, -1787, 184, -496, 245, 1932, 2115, 2626, -4306, -345, -255, 1600, 1121, 4432, -385, -1104, -1880, 336, 5114, -603, -1597, -794, 170, 1132, 1981, 325, 240, -62, -2801, -2318, -3531, 2813, 608, 1977, 885, -3083, 2044, -273, -2101, 78, 1676, 1327, 2503, -1648, 576, -1242, 1823, -712, 3832, -2835, 1806, 2964, 3244, 3649, -2139, -2350, -5510, 3237, 2957, -1899, 405, 1240, -1557, -188, 1773, -365, -3345, -884, 3488, 120, 5016, 1500, 2308, -1505, 5390, 3515, 797, 458, -1862, -916, -402, -401, -196, 4778, 5836, 1976, 2351, 1336, -79, 272, 4811, 1733, 3391, -2077, -5019, -2144, -3574, -1759, 3766, -191, -3146, 170, -258, -982, -626, 1644, 4152, 320, -2431, 156, -45, -565, 45, 2260, 150, 5712, 1314, 1891, 488, 2135, 3475, 0, 2619]
554268f93M644k424l701K469N511o855K330l658K35K91k89M343j906j941Q57N55c695
536227B812k257j517N31p55K865mm48k053K488Q04p21j576N42J09N76j712K91i98
517023B264j311L004k370o091K662m33J501M32j49l77O37q77K288l711P85n01c818
498675b338O273o648K858j786L428n018J731K214L455r7k577K726l738q25R85C268
481208C38j109r5k44k827L353J305j005j780O667n683n23j116M064l461L677L64c129
462566a342L062k76l309J790j261J871l37j601Q70J372m83L068N53k246J100m021B393
443769a252n37J976J233J540j431l012M933l114J610j610j360K533m090K227J385B020
425873e34Q50m670K057J534j698J227Q75k926L175k994K926L313l266K176k411b321
$$ y = [-693, 3951, 1527, -2174, 295, 5806, -1049, 1281, -2377, -2142, -1851, -2140, 2203, 297, -1644, -787, -232, -3695, 2812, 555, -962, -431, -1186, 1679, 1675, 1227, -826, 1662, 2466, 1745, 169, 711, 820, 1396, -316, -25, -998, 2264, 953, 3957, 1587, -4504, -1842, -2275, -774, -342, -491, -868, -231, -1108, 1180, -2531, -1746, -2247, -3818, -2338, 3935, -2713, 145, -1641, 1787, -3231, -1500, 714, 4169, 4072, 1495, 4221, 483, -342, 643, 3268, 338, -771, -866, -1110, -3937, -584, 721, -284, -2064, 4603, -1080, -1603, -2719, 1345, -2116, 1561, 1925, -3129, -1342, 1720, 1444, -1865, -75, -1336, 535, 198, -1403, -533, 839, 356, 3424, 3977, 1731, 2831, -1190, 2393, -1252, -1789, 187, 1420, 2960, 1529, -1483, 3450, 336, 1946, 336, -1024, 1509, -2581, -354, 1031, 2020, -534, 316, -4354, -2297, -763, -2461, -1234, -359, -3285, -110, -3104, -178, 3135, -131, 2045, -366, -2321]
407835a079L10j442j09N96L01L46J964J020r04j973K102l816l33K935j391J388d81
388584G96j966j056L807P44r73l226J339m69j107L756j413r90L154j296K655J130A361
369170@K325k456J380k774L544p6l718K7q6J736k123r62M036j815J908l043L718c52
348502I88j90K5K085M454J437L452L363L021R931J4040J8822K3694K5847J2107A36049
330956A31925k0867k7014j8169o319J3056L3374L9533J7849j9498m3948l4409D9785
316604C5206p338j1641o735m047J257m729k487n77L181o10P68K966K340O79L866A8231
297701B5719K707L993R936J9248K2127J0667j5708k3835k0328r309n268l217l343A0387
280900H435L818l272k385L83k691k610N33q63k854J552N27q49k57j314J292K067F08
$$ y = [-1079, -769, -2211, -2320, -1724, -1423, -1077, 887, 1907, 1003, -970, 1132, -2684, -3017, -82, -1473, -85, -481, 796, -1170, -2226, 1581, 2325, 1352, -1874, -535, -1004, -2111, 1645, 232, -758, 2396, 1100, 3755, 4885, 1361, 0, 2325, -131, 1249, -1525, 2019, 1943, -1775, -1748, -1834, -98, -2221, -3183, 853, -962, 946, -2097, 1621, -352, 988, 798, 823, 2908, 7362, 8799, 12251, 15614, 18635, 28566, 42606, 61428, 85122, 110969, 123076, 136049, 131925, 111058, 84044, 65875, 59556, 72612, 105986, 145519, 163368, 143870, 99922, 65513, 49785, 35206, 27868, 16227, 9492, 5445, 6702, 1973, -514, -1091, 2090, 1480, 2248, 5214, 7554, 8233, 12099, 18231, 25719, 28426, 32419, 42355, 61603, 83730, 94397, 78689, 54854, 34526, 25217, 19949, 16732, 13389, 10387, 8435, 12253, 8981, 6596, 6979, 4288, 1678, 2211, 1348, -1506, 46, 573, -276, -533, -1847, -555, 1512, 608]
260581G81q70J032k543Q28J294j814L332J124O35l201K25K83J441k79J770K726G009
240091I258P621M287J7127J4098R023J555m682q792j2171j2491p891k20k370M186B2190
221731B5603O497J6333J5979L2862N1995J07124K01409K92436K31689J2563k12200D93987
206711B80909j09094n5855l3715k5964j7335j3362j0072k992l982m654k570r77d68
190434B232r98j101l72M957J514L119J980L312k949n47J525j743K446J433J559B1465
170523B4434M404P522J0630J0926M858k745J79q232j1636j1454j2512n501k746I205
152821A2503k030L50m910k291l055J512J271l350M230J589M286J2470P438P723D7733
133799F3321K5899K6798J3867n507j2099N408L2874M3597J4831j2454l9329k2256A44361
$$ y = [781, -89, 943, -1600, -772, 522, -1292, 2040, 3164, 3799, 598, 823, 1106, 2547, 2268, 4038, 6764, 7009, 9258, 16879, 21166, 38293, 52391, 61414, 62969, 58287, 49495, 37324, 24833, 16942, 16722, 14352, 18538, 22190, 25603, 32100, 48433, 64412, 97274, 149269, 256393, 457802, 750238, 981927, 994490, 782290, 493987, 280909, 171815, 115960, 82245, 56281, 38946, 25584, 15512, 12520, 8538, 3884, 1314, 337, -468, 2232, 1234, 133, -239, 4718, 6232, 9351, 11331, 14643, 11694, 11147, 12672, 10929, 13375, 14808, 16367, 21465, 24434, 28838, 36360, 46990, 57916, 62774, 60029, 60208, 51976, 40340, 28886, 16374, 10873, 8127, 9205, 12503, 10473, 10823, 5913, 3622, 567, 2079, 3350, 0, 4230, 5819, 10105, 22575, 30013, 37736, 47733, 63321, 89220, 116018, 129885, 124378, 112279, 117687, 150561, 194158, 208989, 196535, 157206, 134950, 144361]
117037A64233P123j8001l4153l1649k1394r590q543j0662q259p931o212l025o554a90
98952C040N994P269O573O413M181m949n122q87o945j5085K176R2M796J731L423B4767
78300C6049oR985K5507M1179L9969K5053q677l6983F2653
$$ y = [164233, 171356, 153355, 119202, 87553, 66159, 56569, 48026, 37364, 29105, 21174, 14962, 11937, 5383, -190, 3040, 9034, 16303, 22876, 29289, 33470, 28521, 23399, 22512, 15567, 482, 2658, 2750, 7546, 9277, 12700, 24767, 36049, 36043, 46028, 71535, 112714, 152683, 177736, 169059, 132076, 62653]
66073D400  $$checkpoint
##END=