##TITLE= Raman spectrum of Aegirine (no. 5805) � http://rdrs.uaic.ro
##MINERAL= Aegirine
##CHEMISTRY= NaFe+++Si2O6
##JCAMP-DX= 5.01
##DATA TYPE= RAMAN SPECTRUM
##DATA CLASS= XYDATA
##ORIGIN= Department of Geology, UAIC, Romania
##OWNER= http://rdrs.uaic.ro � stud. Apopei Andrei Ionut
##LONGDATE= 2010/09/11 18:30:59.0551 +0300 $$ export date from JSpecView
##SPECTROGRAPHDATASYSTEM= HE 532 (Horiba Jobin-Yvon)
##XUNITS= Raman shift (1/cm)
##YUNITS= Intensity (cnt)
##XFACTOR= 3.188909E-3
##YFACTOR= 1.92030499E-4
##FIRSTX= 3399.61
##FIRSTY= 0.07201731
##LASTX= 210.701
##NPOINTS= 1024
##XYDATA= (X++(Y..Y))
1066073C75J154K502m030K322j361J895j457J992J876l854L274K715l512R34k611A0381
$$ 375 1529 4031 1 2323 962 2857 1400 3392 5268 1414 4688 7403 3891 4825 2214 10381
1052896E962j67M086j283O75l478k487L729j363K807m469j322Q738q685M858R9G960
$$ 5962 5795 9881 8598 9273 5795 3308 7037 5674 8481 4012 2690 11428 2743 7601 7700 7960
1039622I156m94q30k106K757k445M685l005K079M094o970J682l022k196M797K526H863
$$ 9156 8662 7832 5726 8483 6038 10723 7718 9797 13891 6921 8603 5581 3385 8182 10708 8863
1026251F324N448l789j082M556K230M4M28m910l281M49J470L652m811N971j110G076
$$ 6324 11772 7983 6901 11457 13687 13731 14159 9249 5968 6417 7887 11539 6728 12699 11589 7076
1012782D580J788K532m00J590k118k396K30O15N59m38m034L955p18k351N555n8H362
$$ 4580 6368 8900 8500 10090 7972 5576 5806 6421 6980 6542 2508 6463 5745 3394 8949 8891 8362
998410G223J100j223p83o229N714j614N42K118M522o704p32m28J534N101l610H479
$$ 7223 8323 7100 6317 88 5802 4188 4730 6848 11370 4666 3934 3506 5040 10141 6531 8479
984735C763k38J394r9J642m31Q12L716l335n98K388k10j207m31K665n409k837B924
$$ 3763 3525 4919 4820 6462 6031 6843 10559 7224 6626 9014 8804 7597 7166 9831 4422 1585 2924
970147D207l223L966Q14N94K612n268J728k336L443Q72L20k030j477m53J898l13a57
$$ 4207 984 4950 5764 6358 8970 3702 5430 3094 6537 7409 7729 5699 4222 3769 5667 5354 -157
955443C346n88K178j140J709n259J960k022L537q32N253l595k349O112m67k928F799
$$ 3346 2758 4936 3796 5505 246 2206 184 3721 2889 8142 4547 2198 8310 7843 4915 6799
941451D924j487O71k398O147J724k146K003j343k198K227j063l412j669N328k497B261
$$ 4924 3437 4108 1710 7857 9581 7435 9438 8095 5897 8124 7061 3649 1980 7308 4811 2261
927352F790k798J739R92j273k572O65j021L403k677L544m08R0n44j760j980N92H879
$$ 6790 3992 5731 6723 5450 2878 3543 2522 5925 3248 6792 6384 6474 5930 4170 2190 2782 8879
912312D386l524L501n63K148m681M860r17J765j192M96L041l732r94J081Q34n857c3
$$ 4386 862 4363 3800 5948 1267 6127 5210 6975 5783 6279 9320 5588 4594 5675 6509 652 -33
897153E726k287K084k782r28O235l083J979k306k222K646j114k827M253K705l459F249
$$ 5726 3439 5523 2741 1813 8048 4965 6944 4638 2416 5062 3948 1121 5374 8079 4620 6249
882725D230L456J191O38k126l27j460m91J003k894j622L523N37J147J341j202A1633
$$ 4230 7686 8877 9515 7389 7062 5602 5111 6114 3220 1598 5121 5658 6805 8146 6944 11633
868190A281N548k497L919j831J266n950K46M034l541L538P74K23P20r37j62m309E812
$$ 1281 6829 4332 8251 6420 7686 1736 1982 6016 2475 6013 6787 7010 7730 6793 6631 2322 5812
852683H362j679k094M295L770m717M82J284N66n571M549R28m269l550J456J484A195
$$ 8362 6683 4589 8884 12654 7937 8419 9703 10269 4698 9247 10175 5906 2356 3812 5296 1195
837923G465m431K676j388M060p51j69l265j467K874k379J521N033k127L873l316A0065
$$ 7465 3034 5710 4322 8382 7631 7462 4197 2730 5604 3225 4746 9779 7652 11525 8209 10065
823053D400j793L544q79k040Q91l255L159O866m084k507M904j289l031j759L468F939
$$ 4400 2607 6151 5272 3232 4123 868 4027 10893 6809 4302 9206 7917 4886 3127 6595 6939
808069E237L552k945j037l995J2236p838N905n404J952k610K864q12R85p01l023E711
$$ 5237 8789 5844 4807 812 13048 5210 11115 5711 7663 5053 7917 7105 8090 7389 4366 5711
792973A1509n262J9k081N660k468j390L450k827j140K15j195K897j056M170l489D602
$$ 11509 6247 6266 4185 9845 7377 5987 9437 6610 5470 5685 4490 7387 6331 10501 7012 4602
777764GN139O466k134j607N49j884N50k25j054M95k685M67J518J021o11j13J989I849
$$ 7 5146 11612 9478 7871 8420 6536 7086 6861 5807 6302 3617 4084 5602 6623 6012 5899 7888 9849
760630F750N583j744K321j577j080m592J188O026o37p523N640j329M42M865m702A0930
$$ 6750 12333 10589 12910 11333 10253 5661 6849 12875 12238 4715 10355 9026 9468 14333 9631 10930
745176A1371n005N391j273M478j39q4q02k78m15m43L234n392J299J326L014J796A6391
$$ 11371 6366 11757 10484 14962 14823 14739 13937 13659 13244 12801 16035 10643 11942 13268 16282 18078 16391
728688A2574K765l872L014o001Q101j991P73m535l32K018J327O35l235Q57K018A3397
$$ 12574 15339 11467 14481 8480 16581 14590 15363 10828 10496 12514 13841 14476 11241 12098 14116 13397
712990A6078J11K378j051j742j162l32j382L981k903j659p18L069K074l566J880A0633
$$ 16078 16189 18567 17516 15774 14612 14280 12898 16879 13976 12317 11599 14668 16742 13176 15056 10633
697176A3039N26J356J300m534Q4p45J439J688l510k929M895j048o62K270k19q1A7324
$$ 13039 13565 14921 16221 11687 11771 11026 12465 14153 10643 7714 12609 11561 10899 13169 12950 12869 17324
680298A3538j711k513M814M74Q61P78j212j544k567K300n830K937N259m474N260A2865
$$ 13538 11827 9314 14128 14602 15463 16241 15029 13485 10918 13218 7388 10325 15584 11110 16370 12865
664233A0466M071J086j762J999L12l918o54L769L14p400M821l113K748M104m606A6950
$$ 10466 14537 15623 13861 15860 16172 12254 11600 15369 15683 8283 13104 9991 12739 16843 12237 16950
648046A5553m245K502k336L74l331n10N823P35j891K064m489R31O28o202L173G417
$$ 15553 11308 13810 11474 11848 8517 8007 13830 14565 12674 14738 10249 11180 11808 5606 8779 7417
631733I899J516k853m235N858l1p21K75o10J576p161O09j37L072Q6j047J830J443G854
$$ 9899 11415 8562 4327 10185 10154 9433 9708 9098 10674 3513 4122 3985 7057 7143 6096 7926 9369 7854
613354H110m35l005L549N07j54J477p591R525j645L113J82r357L254J263l049H944
$$ 8110 7675 4670 8219 8726 8572 10049 2458 11983 10338 13451 13633 4276 7530 8793 5744 8944
596775H330L507J89j717j578j11J078M16J164l149J248k345q78O284k037K581A1942
$$ 8330 11837 12026 10309 8731 8620 9698 10114 11278 8129 9377 7032 6154 12438 10401 12982 11942
580070A1899j038q15k418l716N133R59o617N994l64m539k740O883p19j437o468D010
$$ 11899 10861 10046 7628 3912 9045 10004 3387 9381 9017 4478 1738 8621 7902 6465 -3 4010
563233H438l008j403j705M599m413J423K226P34k749k084L531o43l158K650M94E511
$$ 8438 5430 4027 2322 6921 2508 3931 6157 6891 4142 2058 5589 4946 1788 4438 4932 5511
546268H193l373L099K520n773P53J915l723N762p868R635l883O24l659K784m77D007
$$ 8193 4820 7919 10439 4666 5419 7334 3611 9373 1505 11140 7257 7881 4222 7006 6529 4007
529172D197O688o361O858m588j242M622m722j347L40N873j178N39k62L998J400A1322
$$ 4197 10885 4524 11382 6794 5552 10174 5452 4105 4445 10318 9140 9679 9417 13415 14815 11322
511943F752K815l848n00L510m756M646r65N02j128o29N289k174j759L690m299F995
$$ 6752 9567 5719 5219 8729 3973 8619 7654 8156 7028 6399 11688 9514 7755 11445 7146 6995
494580G482j76J430K620p886M198k657j329j11J467k873J220M622j100k342P00E606
$$ 7482 7306 8736 11356 3470 7668 5011 3682 3571 5038 2165 3385 8007 6907 4565 5265 5606
477079C986M104l470J646P1k693j198L005pK317j803k050J739j356Q01L788j603E289
$$ 3986 8090 4620 6266 6337 3644 2446 5451 5444 7761 5958 3908 5647 4291 5092 8880 7277 5289
458401C025J0843n332Q91n938L575J584l778j152N154R5J063J286k834P33M03H445
$$ 3025 13868 8536 9427 3489 7064 8648 4870 3718 8872 8967 10030 11316 8482 9215 9618 8445
440621D535M718n125L088Q21m156l879O491n924P929p416N414k577L893J655o309E089
$$ 4535 9253 4128 7216 8037 3881 2 6493 569 8498 1082 6496 3919 7812 9467 3158 5089
422699E473J046m46K4J020M66j358K485j635m759N444L729j027J102M93l378M723H558
$$ 5473 6519 6073 6097 7117 7583 6225 8710 7075 2316 7760 11489 10462 11564 12057 8679 13402 8558
403571A1179j277j45J265l436M776j419k276M995k665P2L030n874m84L830j54A1152
$$ 11179 9902 9757 11022 7586 12362 10943 8667 13662 10997 11069 14099 8225 7741 11571 11417 11152
385358A0361o81L354l421J915K411M46k292r38K793l899K016r16k909J984N73A1230
$$ 10361 9680 13034 9613 11528 13939 14385 12093 11155 13948 10049 12065 11149 8240 10224 10797 11230
367003A2463k198j25N569m05o01j183P442O472L871R38Q927l407l68k139o21r00C4824
$$ 12463 10265 10140 15709 15304 14703 13520 20962 27434 31305 32243 41170 37763 37395 35256 34635 33735 34824
347407C4694J997l702M99K902J295j693K95K200L663P57L464L102P910J4544K6844A52074
$$ 34694 36691 32989 33488 36390 37685 35992 36287 38487 42150 42907 46371 49473 57383 71927 98771 152074
328752B61118J27648L9248q2029j21102q0709l8241k0409o146q692k585L163N178H2501
$$ 261118 388766 428014 345985 224883 144174 105933 85524 79378 70686 68101 71264 76442 82501
313278A01442K3555K8059M5585P2845J38843K27762K54331J07421j23324k02768E50281
$$ 101442 124997 153056 198641 271486 410329 638091 892422 999843 876519 673751 550281
299933E16118Q496l5110q3309j09858q8155m9561k9655k6231j0972q875q131n316F8463
$$ 516118 524614 489504 406195 296337 208182 158621 128966 102735 91763 82888 74757 69441 68463
284269F8891J862k456O09M947O380P814K1608K7797L3074M6896K8310l546l7312A65264
$$ 68891 70753 68297 68906 73853 80233 88047 109655 137452 170526 217422 245732 242186 204874 165264
267373A28054k7646j9106j4603k1437q251o403k287j61l262o40o311p30k558K968A6997
$$ 128054 100408 81302 66699 45262 37011 30608 28321 28160 24898 24258 17947 17217 14659 17627 16997
249218A7414m398K954L51n155k172K774L296M565M368J4291l878p973n930p841A6602
$$ 17414 13016 15970 16321 11166 8994 11768 15064 19629 23997 38288 34410 26437 20507 12666 16602
230928A0912k982L872N805p524K15k579K754l855K115L385Q94O949R408J4853F6291
$$ 10912 7930 11802 17607 10083 10298 7719 10473 6618 8733 12118 13012 19961 29369 44222 66291
212499G6857o247r538k1649j2277r789l568j825l015J271K212n807k875K241l537c
$$ 76857 70610 61072 39423 27146 17357 13789 11964 8949 10220 12432 6625 3750 5991 2454 -3
193931D150J417j236L688K998N877O570R394J6392O055J5984K4421L4269N1665B34530
$$ 4150 5567 4331 8019 11017 16894 23464 32858 49250 55305 71289 95710 129979 181644 234530
176395B80758L9928J9361M4335O3612L3785m1556j02767j11775p8033n1316k9104D5735
$$ 280758 320686 340047 384382 447994 481779 440223 337456 225681 147648 96332 67228 45735
161097C8381Q359J5641J7310J1873p445k2586k1137j9135k975o502K940M695O43A7651
$$ 38381 46740 62381 79691 91564 84119 61533 40396 21261 18286 11784 14724 19419 20062 17651
143328A5668o059j095k213o233j34M115R5J053J017N350R130K044J6001J5746I1460
$$ 15668 9609 8514 6301 68 -66 4049 4144 5197 6214 11564 20694 22738 38739 54485 91460
124234A42781O7327M7995K9078j6077l1092j5195j6551j1878P892L2917P1077D04680
$$ 142781 210108 258103 287181 271104 240012 224817 208266 196388 204280 237197 308274 404680
108614D90638J6367n9252j03486r3002q6855l0054l806J6389J9192J0575M560A83626
$$ 490638 507005 447753 344267 251265 164410 134356 130550 146939 166131 176706 181266 183626
92896A90811k754j2445j8152k2918k0743k35N452J714r243k860j3231l51j042I0720
$$ 190811 188057 175612 157460 134542 113799 113564 119016 120730 111487 108627 95396 95045 94003 90720
74638I2967j097K05J0384M0085M4903B28429
$$ 92967 91870 92075 102459 142544 187447 228429
66073B49817  $$checkpoint
##END=