##TITLE= Raman spectrum of Aegirine (no. 5820) � http://rdrs.uaic.ro
##MINERAL= Aegirine
##CHEMISTRY= NaFe+++Si2O6
##JCAMP-DX= 5.01
##DATA TYPE= RAMAN SPECTRUM
##DATA CLASS= XYDATA
##ORIGIN= Department of Geology, UAIC, Romania
##OWNER= http://rdrs.uaic.ro � stud. Apopei Andrei Ionut
##LONGDATE= 2010/09/11 18:32:04.0726 +0300 $$ export date from JSpecView
##SPECTROGRAPHDATASYSTEM= HE 532 (Horiba Jobin-Yvon)
##XUNITS= Raman shift (1/cm)
##YUNITS= Intensity (cnt)
##XFACTOR= 3.188909E-3
##YFACTOR= 9.51197332E-5
##FIRSTX= 3399.61
##FIRSTY= 0.72866
##LASTX= 210.701
##NPOINTS= 1024
##XYDATA= (X++(Y..Y))
1066073G660J0043N802L87q598k847n02j1945O423Q823K126l064P711p974M00m6A1731
$$ 7660 17703 23505 23892 15294 12447 11945 0 6423 15246 17372 14308 22019 14045 14445 14399 11731
1052896I623Q220J577r32l9o625O272j822R120o620M880n613l714q179M829Q235B2982
$$ 9623 17843 19420 18488 18449 11824 18096 16274 25394 18774 23654 18041 14327 6148 10977 19212 22982
1039622B1395L158q619o552j32N116Q356J266p049K218l49j3019K11p92M512O802A5956
$$ 21395 24553 15934 9382 9250 14366 22722 23988 16939 19157 18808 5789 6000 5208 9720 16522 15956
1026251A5838m192l187L123k570J1386r211j842Q95O087k173MJ625j780L971q979H503
$$ 15838 11646 8459 11582 9012 20398 11187 9345 10240 16327 14154 14158 15783 14003 17974 8995 8503
1012782I295R60k778L921l503O379n286j490m894M708K700Q282o174J251n781M044D905
$$ 9295 10255 7477 11398 7895 14274 8988 7498 2604 7312 10012 18294 12120 13371 7590 11634 4905
999213A6375l768k8k650N222j5152R745n270P960m598J152M055l702J936L221B145
$$ 16375 12607 12579 9929 15151 -1 9744 4474 12434 7836 8988 13043 9341 11277 14498 2145
986350D642P466j1289R923r61N404p36o652N462q548N910l578l746O304R877j0889A0318
$$ 4642 12108 819 10742 9781 15185 14449 7797 13259 4711 10621 7043 3297 9601 19478 8589 10318
972587A5005r936J116j953Q152l849J063m98No303j445P208O426m401RO79m232F331
$$ 15005 5069 6185 4232 12384 8535 9598 9100 9105 2802 1357 8565 14991 10590 10599 11278 7046 6331
957901A6670k890o128K749O490j772n008N599o794M037R11M10m055K699m612l719A3373
$$ 16670 13780 7652 10401 16891 15119 10111 15710 8916 12953 13864 14274 10219 12918 8306 4587 13373
943925A5684J363J586j1865Q342l10Q08n053M604R21k261p53L491M76m714L156A2827
$$ 15684 17047 18633 6768 15110 14800 15608 10555 15159 16080 13819 13066 16557 17033 12319 15475 12827
929848A4087L326p224p8K936J1701m877m375P62N395j31n210N452r228R584n75B0300
$$ 14087 17413 10189 10111 13047 24748 19871 15496 16258 21653 21522 16312 21764 12536 22120 21545 20300
915664B1735n653R6j354J939n875R811o83n819N458r948K668K445O296m476P71I419
$$ 21735 16082 16178 14824 16763 10888 20699 20016 14197 19655 9707 12375 14820 21116 16640 17411 9419
901374B0350j907L061k520M7J555l245l022k017J2051J836k965m081n64j233K451A7950
$$ 20350 18443 21504 18984 19031 20586 17341 14319 12302 24353 26189 23224 19143 18579 17346 19797 17950
886980B4588J280l186J894l911L458o813K788J783M185l519J393l797o589K678B6614
$$ 24588 25868 22682 24576 20665 24123 17310 20098 21881 26066 22547 23940 20143 13554 16232 26614
873333A6286K232j005l91M409m47j730o69K512N304l182l516o474Q765j4065M746A6740
$$ 16286 18518 17513 17122 21531 21084 19354 18685 21197 26501 23319 19803 13329 22094 8029 12775 16740
858729A5178J677j952k120M524J230L240p031n859R158l905K459k510J622J454A9792
$$ 15178 16855 14903 12783 17307 18537 21777 14746 8887 18045 14140 16599 14089 15711 17165 19792
844881A7451J566m965K850n523p23P149m686K069j950p030J2619n355l848L967A5213
$$ 17451 19017 14052 16902 11379 10656 17805 13119 15188 13238 6208 18827 13472 9624 13591 15213
830939A6835l87N62j503q258K348Q991r263j113M079O17n969P707n467N027o472A6893
$$ 16835 16448 17010 15507 7249 9597 18588 9325 8212 12291 12908 6939 14646 9179 14206 7734 16893
816016I639K850k229J231O814Q40o137p700Q153L910n802O087l849l905l793N61G621
$$ 9639 12489 10260 11491 18305 19145 13008 5308 13461 17371 11569 17656 13807 9902 6109 6670 7621
800979H684Q041j0604Q041m352q35j003k510j059N137L351J677L127j2782N137A2954
$$ 8684 16725 6121 14162 9810 8975 7972 5462 4403 9540 12891 14568 17695 4913 10050 12954
786727EO532m46Q765n303o69q37J173L35k344O252n136N6n59n191O139k233M353D807
$$ 5 6537 6091 14856 9553 8884 8047 9220 9555 7211 13463 8327 8383 7824 2633 8772 6539 10892 4807
769668A2063k122P144k625J282k792k626O585l742m802O585l966K733K175l855F564
$$ 12063 9941 17085 14460 15742 12950 10324 16909 13167 8365 14950 10984 13717 15892 12037 6564
755189A4878N3N3l073k404K118Q33l94k83K508O695j0722O694k182o479K563K060A6709
$$ 14878 14931 14984 11911 9507 11625 12458 12064 11781 14289 20984 10262 16956 14774 8295 10858 12918 16709
738779A6313j177j401L512J06k016K172r942J5847j74J446l747m751k351l635A3879
$$ 16313 15136 13735 17247 17353 15337 17509 7567 23414 23240 24686 20939 16188 13837 10202 13879
724085A1026j012M738O62O63Q30k073l859M513L28J778L83q214j850M848j069A1962
$$ 11026 10014 14752 15414 16077 16907 14834 10975 15488 15816 17594 17977 9763 7913 12761 11692 11962
708352A6922q438L173l302K001M177K894j0783K447R96K726N461m197k912L507A2151
$$ 16922 8484 11657 8355 10356 14533 17427 6644 9091 10087 12813 18274 14077 11165 14672 12151
693438A646R982n424N739J163K167o877m141k689J1991j741n258L674R94j741D172
$$ 1646 11628 6204 11943 13106 15273 8396 4255 1566 13557 11816 6558 10232 11226 9485 4172
678414A0190K054J888J329j23o151k300K278Q83l026N292J497K277k523m142o318A0518
$$ 10190 12244 14132 15461 15338 9187 6887 9165 10048 7022 12314 13811 16088 13565 9423 3105 10518
662336G046j1q49J0707m756j909N47L115j071J440o040P581n593Q82O799l248E697
$$ 7046 7035 6186 16893 12137 10228 10775 13890 12819 14259 8219 15800 10207 11089 17888 14640 5697
646133A0654J497j351r04L24o988P469l806P302q440P470n314r59K68P247n928I815
$$ 10654 12151 10800 9896 10220 3232 10701 6895 14197 5757 13227 7913 6954 7222 14469 8541 9815
629808E395J218k355L507O242O04j4635O465M121K279q774L284o819L81N796Q84I537
$$ 5395 6613 4258 7765 14007 14611 -24 6441 10562 12841 4067 7351 532 913 6709 7593 9537
613354G519N517r443N294J889R41m251m55K726j850O299m753p488L899K616J60H835
$$ 7519 13036 3593 8887 10776 11717 7466 7011 9737 7887 14186 9433 1945 5844 8460 8620 8835
596775A4298j459p767L789j906N687k631j18L565o873O022L287J166j4967P027A3021
$$ 14298 12839 5072 8861 6955 12642 10011 9893 13458 6585 12607 15894 17060 2093 9120 13021
581055H493K674m974P027K450l801N0m918k294N576o480p87K507J1717j0165J949C716
$$ 8493 11167 6193 13220 15670 11869 11919 7001 4707 10283 3803 3016 5523 17240 7075 9024 3716
564227C097L512L289o312L456r54j71K786N243o424o591J64L456O974P77o088I448
$$ 3097 6609 9898 3586 7042 6088 5917 8703 13946 7522 931 1095 4551 11525 12302 6214 9448
547272A238P644n363K173J169m805k013O639J224L401k125j622M964j399n977A0447
$$ 1238 8882 3519 5692 6861 2056 43 6682 7906 11307 9182 7560 12524 11125 5148 10447
531191A1002j121l39o73L010O10k126M99J112j72l800n07J2220k349m917k741A0261
$$ 11002 9881 9542 8869 11879 12489 10363 10862 11974 11802 8002 7495 19715 17366 12449 9708 10261
513975A6006l913l96k015K227m025K840M013k909o370L230J054k073l413L788D408
$$ 16006 12093 11697 9682 11909 7884 10724 14737 11828 5458 8688 9742 7669 4256 8044 4408
497653G860L620p154N573l749K167j406k578M623J663L80m366n874K109o27P12A1982
$$ 7860 11480 4326 9899 6150 8317 6911 4333 8956 10619 10999 6633 759 2868 2241 2953 11982
480177D488m145O54Q413K08m483K216j916Q802q281l201P62L5K658O454n996l428I971
$$ 4488 343 997 9410 9618 5135 7351 5435 14237 5956 2755 3517 3552 6210 12664 6668 3240 9971
461525H886p506P008j143k51K037n666J1860l659l883j651o118P837K030K699I206
$$ 8886 1380 8388 7245 6994 9031 3365 15225 11566 7683 6032 -86 7751 9781 12480 9206
444817I559k328n901j268O377M814k389M532o577L302n631N421n577O144k343G411
$$ 9559 7231 1330 62 6439 11253 8864 13396 6819 10121 4490 9911 4334 10478 8135 7411
427986E513P80n62L792p486M291j571n69J329l48L502l366J211J711o106N225A3852
$$ 5513 6293 5731 9523 2037 6328 4757 4188 5517 5169 8671 5305 6516 8227 2121 7346 13852
409965I137j200o896N774M209m501N210m85p11O432j0539k615k226R996N05q596A0414
$$ 9137 7937 1041 6815 11024 6523 11733 11248 10537 16969 6430 3815 1589 11585 12090 3494 10414
391802D771O357o093K389K945M283k028p390P569n441l07J92k211J0514k942p578A3303
$$ 4771 11128 5035 7424 10369 14652 12624 5234 12803 7362 7055 7247 5036 15550 12608 5030 13303
373498G785M359m296L293M43n09o150J104J268M28Q630m380J2643k935P054M705D0043
$$ 7785 12144 7848 11141 11584 11075 4925 6029 7297 7725 16355 11975 24618 21683 28737 33442 40043
355049D6639N588p086J66L457o931N012K105M82K55n331J0686l497Q53P37P878F1240
$$ 46639 52227 45141 45307 48764 41833 46845 48950 49432 49687 44356 55042 51545 52398 53135 61013 61240
336454F0066L735K278P131J1424K6212N8082J41139J30474R390j15151j25929A37119
$$ 60066 63801 66079 73210 84634 110846 168928 310067 440541 449931 334780 208851 137119
322132A13557j3185m818j3753m660J419j321l001M640O199J447J9641R809L6990B12889
$$ 113557 100372 95554 81801 77141 78560 77239 74238 78878 85077 86524 106165 115974 152964 212889
305502B89722N3496N5052O6264Q4680J37706R7117j3473j67545k04057j34959A95857
$$ 289722 343218 398270 464534 549214 686920 784037 770564 603019 398962 264003 195857
292114A52042l2770j6588j2017o721J087k213o798P206n584P862R919L604L2345A61199
$$ 152042 119272 102684 90667 83946 85033 82820 76022 83228 77644 85506 95425 99029 131374 161199
275273B35227R4452Q7801P1045j0963p1871r6163o2455n3196n1251l7639l1395F4350
$$ 235227 329679 417480 488525 477562 405691 309528 247073 193877 142626 104987 73592 64350
260581E6047o525j0161l193m598r22n341p17k401J162K05m048M093J068l183J774B9157
$$ 56047 49522 39361 36168 31570 30648 25307 24590 22189 23351 23556 19508 23601 24669 21486 23260 29157
241234C3870M871K6520k86M283k1685k0970q476K008p158q05J584r39K400L672A2336
$$ 33870 38741 65261 64975 69258 47573 26603 18127 20135 12977 12172 13756 12817 15217 18889 12336
222882A8051p16K901O798o95M206J8931L0585J5279K4198j6173k7294k5632r177B3588
$$ 18051 17335 20236 27034 26339 30545 49476 80061 95340 119538 103365 76071 50439 41262 23588
205552B2368j512k641r409q807P144M675o950j659k288r06J0022N039L854R421C8316
$$ 22368 20856 18215 8806 -1 7143 11818 4868 3209 921 15 10037 15076 18930 28351 38316
186931E3794J8254J8184K7100K0499L4886L7998N9976P0456P2170N8925R7369G14138
$$ 53794 72048 90232 117332 137831 172717 210715 270691 341147 413317 472242 569611 714138
171699I08718R1185q4391k34344k17274j61806r9974p5874k5874n908J9028M8428B30087
$$ 908718 999903 915512 681168 463894 302088 202114 126240 100366 94458 113486 161914 230087
156371B44655k1399o3672p3738l8476k1747j7020M34M045R107p324k763o132j015i7
$$ 244655 223256 159584 85846 47370 25623 8603 9037 13082 22189 14865 12102 5970 4955 -97
138568H564j405o393o62j22O109J011J4333R401J5131J6282P1080R1268J08440D26944
$$ 8564 7159 766 104 -18 6091 7102 21435 30836 45967 62249 133329 224597 333037 426944
120638D59312k7713k7623k0386k5933k6904m0265m1682K6397O9470R1611N4134D79496
$$ 459312 431599 403976 383590 357657 330753 290488 248806 275203 344673 436284 490418 479496
104995C84430j25454p0212k9710L6417N6099M2567J4803k303K8824K5005k595C44367
$$ 384430 258976 188764 159054 195471 251570 294137 308940 306637 335461 360466 357871 344367
89255C24982k7339k8032J0182k1435j2249j7911l8366j3216K001l496p85l154A58123
$$ 324982 297643 269611 279793 258358 246109 228198 189832 176616 178617 175121 174336 171182 158123
72194A81211L3167Q7122J19525E28024
$$ 181211 214378 301500 421025 528024
66073E60363  $$checkpoint
##END=