##TITLE= Raman spectrum of Anatase � http://rdrs.uaic.ro
##MINERAL= Anatase
##CHEMISTRY= TiO2
##JCAMP-DX= 5.01
##DATA TYPE= RAMAN SPECTRUM
##DATA CLASS= XYDATA
##ORIGIN= Department of Geology, UAIC, Romania
##OWNER= http://rdrs.uaic.ro � stud. Apopei Andrei Ionut
##LONGDATE= 2009/12/11 01:53:40.0545 +0200 $$ export date from JSpecView
##XUNITS= Raman shift (1/cm)
##YUNITS= Intensity (cnt)
##XFACTOR= 3.188909E-3
##YFACTOR= 3.53873939E-3
##FIRSTX= 3399.61
##FIRSTY= -0.13510826
##LASTX= 210.701
##NPOINTS= 1024
##XYDATA= (X++(Y..Y))
1066073 -38 2244 849 1476 1955 1460 3355 3521 3411 2400 3558 2124 984 3318 2656 2875 3205 1421 2707
1051341 3054 4174 3566 2131 1136 1796 2291 1003 1332 3242 2027 1510 2170 2591 642 199 1319 2310 2971
1036486 837 2601 1736 1956 2893 2451 -159 760 2341 1422 1680 2066 2490 947 691 3082 2312 384 2132
1021509 1491 3626 2673 875 2607 2335 1916 3869 4039 2831 1163 1592 1873 2909 2676 478 3205 2661
1007207 1529 2420 1565 2658 755 1684 1657 1153 2174 1450 1406 2796 1761 1902 2907 3214 1224 724 958
991988 1543 2642 599 2930 1936 1529 2061 3438 2720 2996 2242 3786 2960 3659 1106 740 1275 2252 2273
976644 2111 2739 2118 1994 3910 993 2009 3155 3289 3002 3542 3310 1736 3968 1808 2974 3001 2955 2009
961175 3140 2672 2591 2510 4892 2440 3720 1564 1760 3702 4542 3214 -8 1918 2943 1211 3799 3685
946399 2598 3661 2868 990 584 2494 2271 4053 1240 2727 3039 3057 2413 1017 2285 4068 3720 4198
931510 3060 965 3172 3854 3047 2718 4393 3586 4508 5172 3557 2457 3747 2831 2853 1404 2859 3562 2977
915664 2595 2470 3853 1835 3622 3755 2161 3838 4816 3773 2988 2698 5056 4987 4257 5751 3513 2930
900531 2751 2187 2118 4660 4518 6453 3738 4294 2204 2246 3648 3524 4558 4655 4219 3139 2979 5299 4863
884428 3121 5607 3333 5304 2625 4688 4159 5100 6630 6781 5130 3627 5450 4810 5714 3990 3644 5338
869050 5028 5344 4666 6580 5130 6676 6440 6644 4679 4698 5950 2771 4831 7993 3950 5752 3565 5660
853546 4061 6965 6376 4813 3489 5400 4461 6150 4752 4603 4160 5664 5974 5825 4774 5708 2782 3808
837923 1157 5950 3446 4213 5330 4699 3996 5516 4683 3390 1950 3542 5557 4889 5892 5112 6612 4545
822175 5015 7653 7276 5705 4501 4473 4977 3956 3394 3328 5799 4740 5776 4974 4319 4545 5581 6009 3753
805413 6644 3561 4650 4140 3445 2420 4206 4816 3496 6090 4126 5746 4462 3655 2076 2757 3015 5148
789405 2815 3789 4286 6252 4451 4947 4909 5368 5477 4097 3526 4866 4220 3483 4969 4599 4413 4391 4756 2988
771471 3885 4929 18 2697 4127 2247 3235 4481 671 4232 6451 4607 2727 3935 2496 2471 6289
756099 4022 4880 3862 2202 3629 4964 951 5043 2849 3633 4581 3178 4898 5755 5491 2763 4980 4899
739695 5444 5804 5448 4668 2805 4066 2956 5761 5018 5048 3368 5107 6405 5387 7586 7542 5165 4662
723163 5648 7755 6444 6272 5181 3999 4746 3877 7952 6917 3456 5087 4916 5003 6083 3726 3189 6953
706492 3934 4390 3835 5615 6733 5371 5570 5201 3894 4462 2586 4257 4183 3723 3503 3871 5617 3982 1594
688753 3379 4024 5607 3367 4841 6425 3893 2794 5133 7087 3122 3110 4550 3362 6513 3947 4581
672754 6648 4488 5362 4692 2553 5689 2337 3269 2602 4564 3787 3288 4295 4734 4162 2544 3352 5851 5539
654725 3703 3355 6409 3600 3843 3461 5065 3491 4600 4129 4450 5580 4284 3669 4378 2368 2362 3110 2297
636544 3617 1996 4218 596 1478 1643 2912 378 3707 2608 3513 2691 3156 976 2307 569 248 3953
619174 4754 2065 3621 4793 2694 2140 1256 3608 355 -86 4236 3595 2735 2023 4804 3009 1252 2015
601667 4689 2218 4932 2408 68 5358 1183 2486 5867 4745 5665 4142 4384 4939 3382 4454 5619
584996 3642 3595 3091 4278 5099 5039 5512 3947 3522 5065 3153 4808 4608 1559 4376 4362 3725 5184 2361
566216 2940 2454 4267 3139 3226 5317 3825 3713 4667 4557 2150 4412 960 5945 4387 4779 4786 4794 4784 5676
546268 3996 4559 4315 4916 7174 5645 6029 5992 7793 8474 7520 7302 7802 8689 8345 8241 7623 10922 7659 7981
526142 9021 10374 9688 10602 8208 9308 8092 11858 9007 10000 8585 8751 9984 6862 11258 10876 7903 7688
507870 4992 5734 8995 5988 6419 6079 6824 4905 5651 6177 7071 6679 6343 6559 4772 4235 7687 5735 6082
488418 5731 4865 6481 4734 4237 9 3556 4108 5946 4808 5250 5453 4958 5934 6266 5900 2759 6199 5337
468797 4420 5470 3965 5125 4484 6508 6639 6972 6533 6792 6720 7218 5841 5750 5200 8564 4024 6248 5568
449006 5623 6044 6613 7861 5965 6128 5242 5055 4426 7600 5279 5935 6112 6012 5250 4488 5269 5938 5872 4628
427986 3862 4326 5763 5968 5216 5952 5694 5454 6812 6937 6307 7000 6037 5128 5284 8637 6952 5781 6170
407835 7753 7496 7422 7438 9052 9304 7404 7745 6007 9561 8923 7070 8523 7291 6223 7469 8235 9514 7648
387509 7655 8285 5659 5623 6927 4976 7598 4209 5504 4959 6397 5847 4468 5329 5269 7302 3174 5993
368085 2963 4012 4893 4926 3724 1712 3409 2990 2403 3082 1663 2869 4550 4133 3585 2794 457 4477 1619
347407 3336 1740 3395 5709 3057 3270 3552 4108 2565 5062 2998 3192 3088 2099 4543 4651 4810 3697
327651 3151 3356 2784 1493 3342 3717 2213 3022 2707 3050 2488 2916 823 2990 2378 1873 1972 1754 1661 3551
305502 -4 4102 2360 1717 1659 2480 2874 563 2661 2585 1532 2443 4085 2471 2838 1235 4408 3773 2454 3099
283147 6148 5702 7605 6969 7910 9399 10941 13288 12617 13966 14502 15220 16081 15708 17226 18024 17311 19666 19555
261714 21078 22211 23250 26695 24844 27750 28173 32822 35226 37443 40799 39869 39692 36994 36794 30730 26225
242376 22804 18187 12852 11963 9418 7700 7047 6448 5811 4200 5198 7188 6770 8980 11943 12296 14524 20337
221731 23392 28323 29579 34823 39021 42135 48945 53973 58874 71459 87484 106836 127644 161540 210952
204393 279519 367277 472997 568371 621785 592418 507177 398045 288642 212696 158994 125110 99338
189267 81897 72439 64842 58189 59665 58373 61645 63288 66942 68875 73389 82524 95673 105211 120675 145339
170523 177327 216346 268737 346908 449828 567024 695258 785362 803978 738352 601405 439821
156371 308962 214180 155180 118214 93540 76803 61736 56021 48136 42288 44085 45072 43945 48901 52755
138568 56388 65133 74430 90126 107661 136982 178621 238313 342031 486871 675076 864663 992209
123036 999841 892499 719982 545013 391503 279229 198471 144411 113614 87828 70400 56349
108614 46557 42055 38892 33098 31786 33764 33351 33728 32324 34615 32020 29262 25110 22452 17960 14137 10522
88040 7154 3555 2667 980 2502 2454 66 -65 2904 3776 3744 4905 7205 11195 13423 16663 20385 23815
66073B9678  $$checkpoint
##END=