##TITLE= Raman spectrum of Anhydrite � http://rdrs.uaic.ro
##MINERAL= Anhydrite
##CHEMISTRY= CaSO4
##JCAMP-DX= 5.01
##DATA TYPE= RAMAN SPECTRUM
##DATA CLASS= XYDATA
##ORIGIN= Department of Geology, UAIC, Romania
##OWNER= http://rdrs.uaic.ro � stud. Apopei Andrei Ionut
##LONGDATE= 2009/11/08 02:11:38.0157 +0200 $$ export date from JSpecView
##XUNITS= Raman shift (1/cm)
##YUNITS= Intensity (cnt)
##XFACTOR= 3.188736E-3
##YFACTOR= 3.87762618E-3
##FIRSTX= 3399.97
##FIRSTY= 109.50596991
##LASTX= 211.234
##NPOINTS= 1024
##XYDATA= (X++(Y..Y))
$$ plain form
1066244 28240 33203 32654 31483 32442 31191 29245 28705 25431 26330 28217 24889 25661 23568 22480 23140 22645 21562
1052288 21856 21968 20133 19857 18990 17314 15349 17036 16876 17095 14913 15189 14689 14771 14155 14619 14009 11918 12740
1037439 12125 13112 11910 11251 12553 13195 11900 11587 9169 11332 11742 10627 11090 10118 11130 9826 8058 9790
1023258 8344 9038 7415 7077 5417 5818 5518 4651 6438 7546 9021 7935 6041 5363 4613 3732 4818 4887
1008970 4030 3846 2815 2444 2463 4094 2317 282 1252 1180 4373 -8 57 3579 2793 2035 3361 1538 2596
993764 1506 2055 1830 1984 1473 2157 2275 1873 2817 3045 2738 2377 2985 1169 2172 2129 1572 691 1094 -147 2103
976813 2721 2643 274 1239 1864 675 1722 1338 2971 4003 2558 2456 490 971 1279 1032 1339 363 606
961343 113 1374 4061 1758 2740 2666 2287 916 1398 861 583 420 1943 545 1323 2718 4491 4507 3993
$$ packed form
1066244B8240M963n49j171R59j251j946n40l274Q99J887l328P72k093j088O60m95B1562
1052288B1856J12j835k76q67j676j965J687j60K19k182K76n00Q2o16M64o10k091A2740
1037439A2125R87j202o59J302O42j295l13k418K163M10j115M63r72J012j304j768I790
1023258H344O94j623l38j660M01l00q67J787J108J475j086j894o78p50q81J086D887
1008970D030j84j031l71J9J631j777k035R70p2L193m381O5L522p86p58J326j823B596
993764A506N49k25J54n11O84J18m02R44K28l07l61O08j816J003m3n57q81M03j241B103
976813B721p8k369R65O25j189J047l84J633J032j445j02j966M81L08k47L07r76F06
961343A13J261K687k303R82p4l79j371M82n37k78j63J523j398P78J395J773J6C993
$$ plain form
945742 3396 1660 2424 2172 3056 1315 3249 2363 1959 4483 1933 489 -13 1396 3750 6410 4217 4227
930845 607 2914 3469 3104 4557 4389 5419 3722 4786 4709 3512 2315 3603 3265 3989 2016 2929 2843 4952
914996 3559 5101 4610 5960 7508 3959 4023 4875 4762 5777 5645 4271 6848 6082 3934 5957 5339 6090
899855 2980 3460 3727 5691 5782 5263 6888 6299 6959 7189 7742 8388 7169 6257 8495 8528 5555 6920 5764 4101
882892 6469 5776 6917 6975 7941 7143 7396 7302 9050 8139 6040 7733 5980 5884 6774 8067 8892 8940 6869 7218
865782 8156 7898 8651 7926 6596 6428 7186 9019 6952 9308 8946 8410 9915 9015 7743 8025 6905 7458 6844
849387 7770 8098 6334 7352 9077 6873 8010 8277 7104 7818 7047 7978 9647 8163 8073 8715 7498 9661
833728 7473 8405 7162 6751 5396 5044 7255 7906 7475 7064 7717 8133 6843 8483 7234 7937 7393 7900 5961
$$ packed form
945742C396j736P64k52Q84j741J934q86m04K524k550j444n02J409K354K660k193D227
930845F07K307N55l65J453j68J030j697J064p7j197j197J288l38P24j973R13q6D952
914996C559J542m91J350J548l549O4Q52j13J015j32j374K577p66k148K023o18F090
899855B980M80K67J964R1n19J625n89O60K30N53O46j219r12K238L3k973J365j156D101
882892F469o93J141N8R66p98K53r4J748r11k099J693j753r6Q90J293Q25M8k071G218
865782H156k58P53p25j330j68P58J833k067K356l62n36J505r00j272K82j120N53F844
849387G770L28j764J018J725k204J137K67j173P14p71R31J669j484r0O42j217I661
833728G473R32j243m11j355l52K211O51m31m11O53M16j290J640j249P03n44N07E961
$$ plain form
817064 6420 5236 5843 4885 7371 6863 6156 4101 5013 5178 5210 3684 4442 4434 2804 6277 6541 5255 4568 4505
799373 6155 5731 5467 4454 3672 3531 3212 2104 1690 4301 3982 6129 3272 3223 2390 2185 103 1162 1234
782420 2047 1658 2797 3541 4912 3169 2793 2100 2544 272 611 -120 1606 2696 1802 1559 3433 3697 2738
765322 5245 4779 4584 3703 2648 1404 1925 3956 4341 4132 2041 2429 3546 5934 5515 4194 5089 4124 5180
748080 6638 4787 6821 6288 6285 5168 7104 5988 6522 7821 7175 7494 6444 5233 7054 8143 9211 9089
731613 7642 9840 5963 7444 5530 8607 8760 8899 7039 8893 10231 8497 8345 6985 7503 6921 9737 10132
715011 9758 7905 8447 7377 4604 5639 6946 6905 6113 7200 6115 6081 5152 5496 6087 5729 5502 4657 5142
697342 6272 6033 4677 3454 6821 5450 4992 3937 4541 6525 5368 3321 3205 3940 5045 4749 5161 4689
$$ packed form
817064F420j184O07r58K486n08p07k055R12J65L2j526P58qj630L473K64j286o87D505
799373F155m24k64j013p82j41l19j108m14K611l19K147k857m9q33k05k082J059A234
782420B047l89J139P44J371j743l76o93M44k272L39p31J726J090q94k43J874K64B738
765322E245m66j95q81j055j244N21K031L85k09k091L88J117K388m19j321Q95r65E180
748080F638j851K034n33lj117J936j116N34J299o46L19j050j211J821J089J068I089
731613G642K198l877J481j914L077J53J39j860J854J338j734j52j360N18n82K816A0132
715011I758j853N42j070k773J035J307m1p92J087j085l4r29L44N91l58k27q45E142
697342F272k39j356j223L367j371m58j055O04J984j157k047j16P35J105k96M12D689
$$ plain form
680467 4392 5463 6393 6554 6265 5448 6437 6014 7832 7177 7997 7687 8258 8809 7497 6052 4953 6199 6884
662504 8560 7087 7411 5545 6101 6092 4647 5589 5025 8193 7650 6770 7273 6667 6234 4492 4915 3212 5749 6516
643431 5612 5401 4504 2476 3371 2169 5483 4949 5309 3700 5218 3341 2494 2936 24 2051 1178 1914
626113 617 1295 1692 2717 1329 622 1018 566 1890 575 1020 2585 1358 2801 3121 2576 2648 3776 3521
607686 3095 2916 3293 3300 3834 4705 5292 4920 3917 3863 3267 4365 7655 6194 6892 6717 4905 6185 5729 6122
588114 5248 4280 6154 6582 4520 5496 5760 6351 7633 7360 6213 6124 4980 3815 3921 5798 5027 4058 2953
569360 4764 3114 3985 3361 3687 4238 4024 3358 3102 2509 4786 3777 3537 5667 3714 3199 2072 6195 5628
550441 2901 3879 3405 2348 3100 4659 4735 3185 3814 3222 4283 4672 4531 4998 5527 4586 5724 5144 6974 8468
$$ packed form
680467D392J071R30J61k89q17R89m23J818o55Q20l10N71N51j312j445j099J246F884
662504H560j473L24j866N56rj445R42n64L168n43q80N03o06m33j742M23j703K537F516
643431E612k11q97k028Q95j202L314n34L60j609J518j877q47M42k912K027q73A914
626113F17O78L97J025j388p07L96m52J324j315M45J565j227J443L20n45P2J128C521
607686C095j79L77PN34Q71N87l72j003n4n96J098L290j461O98j75j812J280m56F122
588114E248r68J874M28k062R76K64N91J282k73j147q9j144j165J06J877p71r69B953
569360D764j650Q71o24L26N51k14o66k56n93K277j009k40K130j953n15j127M123E628
550441B901R78m74j057P52J559P6j550O29n92J061L89j41M67N29r41J138n80J830H468
$$ plain form
530348 6501 6794 7977 7514 8609 7156 7373 7509 8678 7642 8612 8570 9222 7233 7526 8623 8982 8609 8772
511093 7922 7966 8709 7557 7737 5795 4684 4821 6644 4797 4696 6722 3121 5453 3248 4058 3584 2591
492697 2153 2626 3295 2969 3069 1427 2763 2979 1825 3380 3770 2518 2747 1281 2161 3958 2493 2893
474147 1263 3858 4734 3102 3620 2869 3069 3738 3960 5049 5543 5474 6323 5474 5699 6017 6722 5888 6795 6678
453355 6881 5769 5798 5907 5050 5978 4726 5581 6719 4378 4101 5000 5069 3409 4056 2899 1566 2838 3859
433426 4529 2468 764 902 2462 2351 2309 2923 3515 1332 -20 559 1948 1763 862 2873 1554 4146 3838
413324 2688 3832 2862 4297 4276 4994 5389 4863 5392 4759 3499 4704 5280 4231 4808 6699 6525 7050 4859
393043 5833 6900 6550 5981 7281 6588 7171 7423 8055 8086 7858 6841 5647 4226 4825 5002 5742 5995 5051 3214
$$ packed form
530348F501K93J183m63J095j453K17J36J169j036R70m2O52j989K93J097L59l73H772
511093G922M4P43j152J80j942j111J37J823j847j01K026l601K332k205Q10m74B591
492697B153M73O69l26J00j642J336K16j154J555L90j252K29j466Q80J797j465B893
474147A263K595Q76j632N18p51K00O69K22J089M94o9Q49q49K25L18P05q34R07F678
453355F881j112K9J09q57R28j252Q55J138k341k77Q99O9j660O47j157j333J272C859
433426D529k061j704J38J560j11m2O14N92k183j352N79J389j85r01K011j319K592C838
413324B688J144r70J435k1P18L95n26N29o33j260J205N76j049N77J891j74N25D859
393043E833J067l50n69J300o93N83K52O32L1k28j017j194j421N99J77P40K53r44C214
$$ plain form
371505 6191 5700 6119 10067 19051 63917 118021 128521 83414 31026 13605 12114 16095 36403 119546
355216 229851 258490 173173 65093 28929 23561 20731 15057 9027 5861 4473 3937 4628 4401 4903
338818 5364 5744 4737 4123 5172 7478 5917 8658 9296 9872 11462 15399 21958 33222 63681 183603 537992
320092 939734 999853 637408 235188 86251 44481 30819 19191 12527 8338 6530 5568 5187 4868
304559 5832 2970 2658 2882 1460 1440 1560 1313 1279 1537 1880 1509 898 2375 910 1889 372 2634 2173 778
282192 26 1524 800 1874 2534 2836 2976 3102 2519 3769 4458 3911 3376 3165 2600 2912 2912 1705 1688 775 2152
258482 1425 857 2756 1783 2447 1191 2774 3686 2102 2752 2515 1330 2019 3014 3247 3287 2968 3257 3289 2886
235683 3077 3105 3306 2533 2871 3384 2947 3398 1684 2923 2492 2140 1676 634 2579 2815 5205 9817 25963
$$ packed form
371505F191m91M19L948Q984M4866N4104J0500m5107n2388j7421j491L981K0308A19546
355216B29851K8639q5317j08080l6164n368k830n674o030l166j388n36O91k27D903
338818E364L80j007o14J049K306j561K741O38N76J590L937O559J1264L0459J19922E37992
320092I39734O0119l62445m02220j48937m1770j3662j1628o664m189j808r62l81D868
304559E832k862l12K24j422k0J20k47l4K58L43l71o11J477j465R79j517K262m61G78
282192B6J498p24J074O60L02J40J26n83J250O89n47n35k11n65L12%j207j7r13B152
258482A425n68J899r73O64j256J583R12j584O50k37j185O89R95K33M0l19K89L2B886
235683C077K8K01p73L38N13m37M51j714J239m31l52m64j042J945K36K390M612B5963
$$ plain form
213825 50463 64789 55757 30812 12652 4575 2665 3490 3180 4703 8671 23581 62729 111929 141349
196429 115778 67241 35239 26300 26320 21896 12069 5465 3796 2420 3629 3306 1957 1295 2761 1993
177738 1826 1728 876 448 949 1754 2082 2110 -39 2707 4874 9111 11530 22907 50432 104769 163307 198400
156541 189877 142012 87505 49298 29651 20210 14380 10838 8370 7516 6836 5890 5557 5572 5028 5485 5188
136354 6357 7705 14494 23253 26904 23443 15817 9574 4250 2813 1967 800 899 1064 674 2095 1840 1137
114803 2342 82 1304 557 571 1633 297 268 451 1149 -56 637 578 1189 681 687 2084 2172 2875 3145 3578
89425 4603 4666 2099 3621 4153 4087 4164 4041 3144 5886 6670 9819 12215 13607 12007 9307 9751 8651 7463
$$ packed form
213825E0463J4326r032k4945j8160q077j910Q25l10J523L968J4910L9148M9200A41349
196429A15778m8537l2002q939K0m424r827o604j669j376J209l23j349o62J466A993
177738A826r8q52m28N01Q05L28K8k149K746K167M237K419J1377K7525N4337N8538A98400
156541A89877m7865n4507l8207j9647r441n830l542k468q54o80r46l33J5n44M57E188
136354F357J348O789Q759L651l461p626o243n324j437q46j167R9J65l90J421k55A137
114803B342k260J222p47J4J062j336k9J83O98j205O93n9O11n08OJ397Q8P03K70C578
89425D603O3k567J522N32o6P7j23q97K742P84L149K396J392j600k700M44j100G463
66244F779  $$checkpoint
##END=