##TITLE= Raman spectrum of Aragonite � http://rdrs.uaic.ro
##MINERAL= Aragonite
##CHEMISTRY= CaCO3
##JCAMP-DX= 5.01
##DATA TYPE= RAMAN SPECTRUM
##DATA CLASS= XYDATA
##ORIGIN= Department of Geology, UAIC, Romania
##OWNER= http://rdrs.uaic.ro � stud. Apopei Andrei Ionut
##LONGDATE= 2010/01/06 11:48:44.0801 +0200 $$ export date from JSpecView
##SPECTROGRAPHDATASYSTEM= HE 532 (Horiba Jobin-Yvon)
##XUNITS= Raman shift (1/cm)
##YUNITS= Intensity (cnt)
##XFACTOR= 3.188909E-3
##YFACTOR= 2.72339138E-3
##FIRSTX= 3399.61
##FIRSTY= 201.52815848
##LASTX= 210.701
##NPOINTS= 1024
##XYDATA= (X++(Y..Y))
1066073G3999R03J067n60J640K28o66O30o23M97L03p97p48P0N33R98q20k67k90G6114
1050563G6147N47k70Q89Pp61q57J018J384j519p91n40J15N3J314J09j22q30N14G7066
1034915G6766Q04m35J02q46n18R33J45J014k24L73j82n04k66p78p15J397P94j22G7033
1019132G7102k83m09J32J644k97j21q54J72n31K44p28O42K61l40o91j32J281k57G5913
1003215G5880J22m98q2k40o72J492J351j7k80j410n90r48J347P54Q24J05q07m44G6074
987156G6206l9N40n83p9P18n47J94j041R43P37j350J136M32k6j98q90J127j179G6308
970959G6209L23K80o85j35l23k24Q6o75n87J077Q01M81J65m29k3L82m6l03K97G6374
953803G6588p67O06r55O2LM42j45M3r9q93m78O10J519k47k41J02j45n80M06L45G5883
$$ y = [73999, 74902, 75969, 75409, 77049, 77277, 76611, 77241, 76618, 77115, 77418, 76621, 75873, 75943, 76476, 77474, 76654, 76387, 76097, 76114, 76147, 76694, 76424, 77313, 77320, 76559, 75702, 76720, 78104, 76585, 75794, 75254, 75369, 75422, 76736, 76845, 76723, 75893, 76407, 77066, 76766, 77570, 77135, 77237, 76391, 75873, 76806, 76951, 77965, 77741, 78114, 77932, 77428, 77162, 76384, 75669, 77066, 77860, 77738, 77033, 77102, 76819, 76410, 76542, 78186, 77889, 77768, 76914, 77086, 76555, 76799, 76071, 76713, 76974, 76634, 75943, 75811, 77092, 76835, 75913, 75880, 76002, 75504, 75422, 75182, 74510, 76002, 77353, 77336, 77056, 75646, 75056, 74108, 75455, 76209, 77033, 77138, 76331, 75887, 76074, 76206, 76167, 76707, 76124, 76045, 76763, 76216, 76410, 75369, 76312, 77049, 75699, 76835, 77267, 77241, 77043, 76153, 77280, 76101, 76308, 76209, 76532, 76812, 76127, 75992, 75669, 75445, 75531, 74856, 74269, 75346, 76147, 76628, 76793, 76364, 76341, 76723, 76677, 76374, 76671, 76374, 76588, 75821, 76427, 75472, 75534, 75537, 75979, 75834, 75877, 75778, 74885, 74407, 75017, 76536, 76289, 76048, 76150, 76005, 75425, 75831, 76176, 75883]
935655G5574l27j64M18n14j12j387M52N63J98r3O59O99p61L78N14J160j380j81G6104
919010G5445r98m51O85K3q66J169L26J42P61j166J31K0P35k54K70L13P28p80j85G4941
901374G4361n27l09j229J163J670K181Q2j05J6k63P9k01M25K57o20K37J55M29G7445
884428G5896J65k27P54Q37j140r35N37M34J430O52m57r36N60j183J62L16J176G8575
868190G8459j083M94Q04K80m91N00j475j071L76R38Q77J81m05l56P48O62K0j022G7626
850952G8690m15o46o13J447q34J397K64j285O52k31K3k50J377p31J61o88Q53L29G9365
833561G8769O06K7m68o52p15L46K33Q73M0m91J75o9K60M08m18J65k28j78p34o9G8562
814253G9141K31K44j002k016R72k3M31p14N60j466m88J048J265R29j32j222J077G9010
$$ y = [75574, 75247, 75083, 75501, 74987, 74875, 73488, 73940, 74503, 74701, 74608, 75267, 75966, 75205, 75583, 76097, 77257, 75877, 75696, 76104, 75445, 74447, 73996, 74681, 74704, 73838, 75007, 75333, 75475, 76236, 75070, 75201, 75221, 75956, 75702, 75972, 76285, 77013, 76233, 76048, 74941, 74361, 73834, 73525, 72296, 73459, 75129, 77310, 77392, 77287, 77303, 77040, 77119, 76918, 77343, 77600, 76980, 77217, 77372, 77801, 77445, 75896, 76061, 75834, 76588, 77425, 76285, 75350, 75887, 76321, 77751, 78403, 77946, 77010, 77570, 76387, 76549, 76865, 78041, 78575, 78459, 77376, 77870, 78674, 78954, 78463, 78963, 77488, 76417, 76793, 77731, 78608, 78789, 78384, 78028, 78776, 79438, 79458, 78436, 77626, 78690, 78275, 77629, 77016, 78463, 77629, 79026, 79290, 78005, 78657, 78426, 78449, 78199, 79576, 78845, 79006, 78318, 79171, 79500, 79365, 78769, 79375, 79402, 78934, 78282, 77567, 77913, 78146, 79019, 79059, 78568, 78743, 78674, 78934, 79342, 78924, 79089, 78861, 78683, 77949, 77880, 78562, 79141, 79372, 79616, 78614, 76598, 77570, 77547, 77978, 77264, 77824, 76358, 75870, 76918, 78183, 79112, 78980, 77758, 78835, 79010]
797426G9072K83j44q47l13P77p21J58M65L09n96m81J28O07j480k89o16N30K767G8651
779561G9372l62M9p6k37p2L95J48k316K21L66J825J45N40K34o82L19L43M74Q77H1638
760630H0393j288O69M05L36j594p42N08R45J071l00K0Q10j81r39oM51o56N50R39H0479
741526H0881o92J008K83O82r12j65m18o59J749P31j156K062j067k14P28o49o62H1157
724085H1391l49J48J288m44q30K17m09L56j41N43l29M31k20J87j87P37o48M44H2037
705564H1464Q10r5k47l23N70m88l72j22J397r06q34P38L36m9N20j71j206q56K80H0288
685940H0564N21o10Q08J87m67R5j48N93J41K94m58r2j437J394p9P28p51m98N24H1721
666131H0545M21j81R19O10M6j196n30M97P08k96r13j02k67q00J81J226J344j038H0452
$$ y = [79072, 79355, 79211, 78364, 78051, 78828, 78107, 78265, 78730, 79039, 78443, 77962, 78090, 78697, 77217, 76928, 76312, 76842, 79609, 78651, 79372, 79010, 79059, 78983, 78746, 78674, 79069, 79217, 76901, 77122, 77488, 79313, 79458, 79998, 80232, 79550, 79869, 80212, 80686, 81563, 81638, 80393, 79105, 79774, 80179, 80515, 78921, 78179, 78687, 79632, 80703, 80403, 80423, 81233, 81052, 80113, 80107, 80558, 79902, 80452, 81391, 80479, 80881, 80189, 81197, 81480, 82162, 81250, 81085, 80667, 80008, 81757, 82488, 81332, 83394, 82327, 82113, 82841, 82192, 81530, 81157, 81391, 81042, 81190, 82478, 82034, 81204, 81421, 81012, 81368, 81227, 81770, 81441, 81872, 81652, 81839, 81652, 82389, 81741, 82185, 82037, 81464, 82274, 82179, 81932, 81609, 82179, 81691, 81319, 81197, 82594, 81688, 80854, 81592, 81928, 81879, 82399, 82228, 81022, 80166, 80446, 80288, 80564, 81085, 80475, 81283, 81470, 81003, 81098, 80950, 81543, 81684, 81978, 81520, 81428, 79991, 81385, 81306, 82034, 81283, 80785, 81309, 81721, 80545, 80966, 80785, 81704, 82314, 82360, 81164, 80634, 81131, 81839, 81543, 80630, 80528, 80261, 79461, 79642, 80868, 82212, 81174, 80452]
647090G9372q99J960L49J81n07P77k167K24k41J123J52N20l75n83m0j097o52m58G9108
627876G9194m61Q5R76j157p71j307P11N70l56J72K60o85Q10p18Q99J209j55m97G8519
608490G8558r5R9r29N56m67K773p94m41j130O00l89N17n47N04l9o69o46K54O46G8179
587947G7349J95N86l03Q00j093J78J61k83j16p05j18j206k306l19J891J472P3G4852
569192G5788J103K725J6j041L6l29p48L13P08K38J68p28j12p9l63l29N63n20n04G6878
548272G6763Q9M31j004q50L92O9m88k07l59M15J670l10N90j68j212N2q99O59o79G5603
527152G5560j61L6n6K64p12m41K73r9o5K14k08l75R8n30L6n00j72l75j88R55p41G2760
503787G1868N69j489O82J85P81L82j29J532K342K231j06m108k447k181N20l39F9871
$$ y = [79372, 78473, 80433, 80782, 80963, 80456, 81233, 79066, 79290, 79049, 80172, 80324, 80844, 80469, 79886, 79846, 78749, 78097, 77639, 79108, 79194, 78733, 78818, 79794, 78637, 77866, 76559, 77270, 77840, 77484, 77656, 77916, 77231, 78041, 77323, 78222, 79431, 79276, 78779, 78519, 78558, 78463, 78562, 77633, 78189, 77722, 80495, 79701, 79260, 78130, 78730, 78341, 78858, 78311, 78815, 78776, 78107, 77461, 77715, 78361, 78179, 77349, 77544, 78130, 77827, 78627, 77534, 77712, 77873, 77590, 77474, 76769, 76651, 75445, 73139, 72820, 74711, 76183, 76256, 74852, 75788, 76891, 79616, 79632, 78591, 78627, 78298, 77550, 77863, 78571, 78809, 78977, 78249, 78137, 78058, 77695, 77366, 77929, 77409, 76905, 76878, 76763, 76852, 77283, 76279, 75429, 75821, 75890, 75402, 75195, 74836, 75251, 76921, 76611, 77201, 77033, 75821, 75873, 74974, 75633, 74954, 75603, 75560, 75399, 75435, 75379, 75643, 74931, 74490, 74763, 74664, 74599, 74813, 74605, 74230, 74328, 73798, 73834, 73334, 73162, 72787, 72599, 73554, 72813, 72760, 71868, 72437, 70948, 71630, 71815, 72596, 72978, 72849, 74381, 76723, 78954, 78848, 74740, 72293, 70112, 70632, 70293, 69871]
485332F9143l52n31J407j021r79n2J12Q69l72l85m78M6k86l59k41o3o5Q23O79F7559
463607F7341R19K84K009O780L488m41n515n409n40j311r52q57K05L68J75R88j58F6323
443769F5582p84L26O03P05j337N99n20l53N0N27o29l76k17J12n67R2M42q44Q77F4011
421640F4087l3m22q53L88P09j42K93j064j0k80L92r68O92J6n3k93r55N04n44j28F1744
398230F1813J92J077n27m61l04l39J005j94J91m22j3m6O06n08n56m25j311Q33F0269
376740F0664m19o5J21k17M18rK93r99j44Q63O42j677M19l36o23m81P68K57j265E9896
353958E8506l00PM74Q57P41L0J475J970L947K1587K43390N02473K08528k72565B47976
336454H7410j8339n288j031M32r98j667j585k53J6j97k15M39q57m28q30R5o36E6651
$$ y = [69143, 68791, 68260, 69667, 68646, 67667, 67615, 67727, 68596, 68224, 67839, 67361, 67407, 67121, 66762, 66521, 66458, 66393, 67216, 67895, 67559, 67341, 68260, 68544, 70553, 77333, 80821, 80380, 74865, 69456, 68916, 67605, 66653, 65796, 66001, 66369, 66544, 67532, 67374, 66323, 65582, 64798, 65124, 65727, 66432, 65095, 65694, 65174, 64821, 64871, 65398, 64769, 64393, 64176, 64288, 63721, 63813, 64255, 63411, 64288, 64011, 64087, 64054, 63632, 62779, 63167, 63876, 63734, 64027, 62963, 62953, 62673, 63065, 62097, 62789, 62805, 62752, 62459, 61504, 62008, 61464, 61336, 61744, 61813, 62005, 63082, 62555, 62094, 61790, 61451, 62456, 62262, 62453, 62031, 62018, 61972, 62578, 62070, 61514, 61089, 59778, 60611, 60269, 60664, 60245, 60180, 60301, 60084, 60502, 60493, 60786, 59787, 59643, 60506, 61148, 59471, 59890, 59554, 58931, 58450, 59218, 59475, 58210, 59896, 58506, 58206, 58213, 58687, 59544, 60285, 60315, 61790, 63760, 67707, 89294, 332684, 835157, 1043685, 771120, 247976, 87410, 69071, 63783, 62752, 63184, 62186, 60519, 58934, 58681, 58697, 58500, 58285, 58724, 57867, 57439, 56609, 56704, 56068, 56651]
315493E7538r3k30p97j32j690J3Q76R69O98p38k76M11J16N6r20O3j159P08o95E4569
292114E5057M51L20l10N6o16M81j25n34n07n44Q63J002M45j199M05N83P05n70E5904
269633E5759K092M48K01k376p11r52J78m22j94q6J140n24L85j6K07n37p11N11E3924
246940E3901R68m74Q20k73j16q07n63M25q33Q69K97J08j48p94l56N04P65M144F2308
224034F8557J0943K1133K0510k260k4002k5491j1032l848j090m75m84j55j51l26E1450
205552E1341K90J94j28k93p9R2K57K93p12m81O39N74r26m38K6R3J91m95n9p2j65E0099
178740D9737k74Q01n77j81l16r79Q41j295K70k47J05J98l6L89J05K04k63l66k0D8113
154005D6989O26J002J08m05K3o68k18J98k47Q40k28L73j031K07j110n6P84O69D7434
$$ y = [57538, 57445, 57215, 56418, 56286, 54596, 54609, 55485, 56454, 57152, 56414, 56138, 56549, 56665, 56721, 55801, 55864, 54705, 55413, 54718, 54569, 55057, 55508, 55828, 55518, 55574, 54958, 55439, 55314, 54780, 54273, 53729, 54592, 55594, 56039, 54840, 55245, 55828, 56533, 55963, 55904, 55759, 57851, 58299, 58500, 56124, 55413, 54461, 54639, 54217, 54023, 53937, 55077, 54553, 54938, 54922, 55129, 54592, 53881, 54392, 53924, 53901, 54869, 54395, 55215, 54942, 54826, 54019, 53456, 53881, 53048, 53917, 54214, 54322, 54174, 53380, 53024, 53528, 54293, 58437, 62308, 68557, 79500, 100633, 121143, 118883, 94881, 69390, 58358, 54510, 53420, 52945, 52461, 52306, 52155, 51829, 51450, 51341, 51631, 51825, 51697, 51404, 51325, 51417, 51674, 51967, 51255, 50774, 51413, 51987, 51061, 50623, 50649, 50742, 50933, 50438, 50379, 50307, 50142, 50099, 49737, 49463, 50264, 49687, 49506, 49190, 48211, 49052, 47757, 48027, 47780, 47885, 48083, 48047, 48436, 48541, 48745, 48482, 48116, 48096, 48113, 46989, 47615, 48617, 48725, 48320, 48343, 47675, 47457, 47655, 47408, 48248, 48020, 48393, 47362, 47569, 46459, 46403, 47187, 47856, 47434]
130217D7750k37q23q40K63n70n3k63L89m09o46J36l43K01N27p81k14j94L82K57D4262
104995D4443j55m25M0P24n00K20J98q60J651J037J377K303L304M619M424M730G2375
83175G8746O776M207L041J060n735r820j1128q647l700J944P995K4374A56629
$$ y = [47750, 47513, 46690, 45850, 46113, 45543, 45490, 45227, 45616, 45207, 44561, 44697, 44354, 44555, 45082, 44301, 44087, 43893, 44275, 44532, 44262, 44443, 44288, 43863, 43903, 44627, 44127, 44347, 44545, 43685, 45336, 46373, 47750, 50053, 53357, 57976, 62400, 67130, 72375, 78746, 85522, 89729, 92770, 93830, 88095, 78275, 67147, 58500, 54800, 56744, 64739, 89113, 156629]
66073B51804  $$checkpoint
##END=