##TITLE= Raman spectrum of Arcanite � http://rdrs.uaic.ro
##MINERAL= Arcanite
##CHEMISTRY= K2SO4
##JCAMP-DX= 5.01
##DATA TYPE= RAMAN SPECTRUM
##DATA CLASS= XYDATA
##ORIGIN= Department of Geology, UAIC, Romania
##OWNER= http://rdrs.uaic.ro � stud. Apopei Andrei Ionut
##LONGDATE= 2009/11/07 00:09:54.0127 +0200 $$ export date from JSpecView
##XUNITS= Raman shift (1/cm)
##YUNITS= Intensity (cnt)
##XFACTOR= 3.188736E-3
##YFACTOR= 2.54460905E-3
##FIRSTX= 3399.97
##FIRSTY= 176.78106281
##LASTX= 211.234
##NPOINTS= 1024
##XYDATA= (X++(Y..Y))
1066244F9473J863O20J454R77K026Q3N99j08j363j260p03k7J64j37J014n78m76G2682
1051508G2016J171m2l9j67N97J080j014L05Q99k017j156q67O72J463O99m34M4l3G2686
1035868G4097J65r98m65o64j90J040O24J52N59p07k7j51L93l007L88M28J081q4G3028
1020094G2021j110m20K80M40J611k86J043j500o32j033l13j008k57N91Q64k92M34F9525
1004981F8924n91K88l33L86r31N24Q20P24R05l71r04k602q1m94J310J600L13j592F6764
988937F6848J116J304N68o07p5m03o64J44J44o22j56l90j36O03p9Q3K53N8j02F7073
971940F7228p3o5M6l74m82j35q93j21l39K30M0J37j16L08J5Q37k53Q37q41K38F5577
953970F5197k54p76j19l84L79J288n16m44j492K38j094J463Q47J071l59p18R66F5051
$$ plain form
1066244 69473 71336 71956 73410 74387 76413 76496 77095 76987 75624 74364 73661 73634 73798 73661 74675 74097 73621 72682
1051508 72016 73187 73145 73106 72939 73536 74616 73602 73907 74806 72789 71633 70766 71438 72901 73600 73166 73210 73177 72686
1035868 74097 74262 73264 72799 72135 71945 72985 73609 73761 74320 73613 73586 73435 73828 70821 71209 71637 72718 72634 73028
1020094 72021 70911 70491 70771 71211 72822 72536 73579 72079 71447 70414 70101 69093 68836 69427 70291 69999 70433 69525
1004981 68924 68333 68621 68288 68674 67743 68267 69087 69811 70716 70345 69441 66839 66758 66264 67574 69174 69487 67895 66764
988937 66848 67964 69268 69836 69229 69154 68751 68087 68231 68375 67753 67597 67207 67071 67674 67595 67678 67931 67989 67887 67073
971940 67228 67155 67090 67136 66762 66280 66145 65252 65131 64792 65022 65062 65199 65083 65391 65406 66243 65990 66827 65986 66224 65577
953970 65197 64943 64167 64048 63664 64043 65331 64815 64371 62879 63117 62023 63486 64333 65404 65045 64327 65293 65051
938309F5120m19L46j661m78P31k53q16p13j419N4N13p7K045P95j73r2L94O28o8F3853
920851F3563l54k782l73P7J158m11k11J131M30j25j21n34m37L72O26J404m13L55F3703
904073F2301p26j684j436j600j227K09K612L693K918j99q91J21m80O03O3N0n82F3714
887998F4169Q49q85l09o36p64o99L03l03M6n03J060J667J691m24j621j073l7q8F3286
870931F3490O56l4k59o42P38O66J110n2j623k148j58J75J855J363J56K40j56P34F5700
853714F4809j241J089K57o22j30n99K09J123J661L34m2j55P12o97m76K82J34l01F5429
836347F5512J017N28j88m18m77n16j723r60r4K508M36R8j58M1R60O60r92n92M30F5788
817945F5521j142R60J98O76n67j747j840j00K128M91k93o92k352k074J110K533F5498
$$ plain form
938309 65120 64701 65047 63386 62908 63639 63386 62570 61857 60438 60492 61005 60928 62973 63768 63595 63503 63897 64525 64457 63853
920851 63563 63209 60427 60054 60131 61289 60878 60667 61798 62228 62103 61982 61448 61011 61383 62009 63413 63000 63355 63703
904073 62301 61575 59891 58455 56855 55628 55837 58449 62142 65060 64861 63970 64091 63611 64214 64277 64327 63745 63714
887998 64169 65018 64133 63824 63188 62424 61725 62028 61725 61771 61268 62328 63995 65686 65262 63641 62568 62531 62443 63286
870931 63490 64146 64112 63853 63211 63949 64615 65725 65673 64050 61902 61744 61919 63774 65137 65293 65533 65377 66111 65700
853714 64809 63568 64657 64914 64292 64162 63563 63772 64895 66556 66890 66848 66693 67405 66708 66232 66514 66648 66347 65429
836347 65512 66529 67057 66869 66451 65974 65458 63735 62775 62681 65189 65625 65723 65565 65606 66566 67226 66234 65642 66072 65788
817945 65521 64379 65339 65537 66213 65646 63899 62059 61959 64087 64578 64285 63593 61241 59167 60277 62810 65498
802036F5704j12q54k31J018J120k90j0m8p89M40q7P24l03n90m65k82J550j799F0907
784210F1166K320K876J099o44J69j74r6k67R58L28o47j338j258O09J048K934N28G0433
767128G0967J402J346m57j27j154j158q16q56j19n48k027k710m84K360K775m03F7918
750812F8023k40O32l40n64l5k05N5J174l52m6k00M82M23k50m66r09k61Q51J150F8751
731613G0353R21o14p89j31L19p01j845L45o70J650O58j75n47N4l1n99j469O84F8359
713160F8912N34k99j37L69L96k29p64J92o68j46l36J154M61k17K1j37M23p91K55F9154
693604F8016K03r98k19J46n49r87p9r16M43J471Q03j221N64j65P03R2J483p38F5809
674810F5917O45J473R6j221j77J106Q22n22j264j9O91J367L71r10n71k72L24k3F6837
$$ plain form
802036 65704 65592 64738 64507 65525 66645 66355 66345 66297 65508 65948 65861 66585 66282 65692 65227 64945 66495 64696 60907
784210 61166 63486 66362 67461 66817 66986 66812 66716 66449 67407 67735 67088 65750 64492 65101 66149 69083 69611 70433
767128 70967 72369 73715 73258 73131 71977 70819 70003 69147 69028 68480 66453 63743 63259 65619 68394 67991 67918
750812 68023 67783 68415 68075 67511 67476 67271 67326 68500 68148 68102 67902 68384 68807 68557 68091 67182 66921 67772 68922 68751
731613 70353 71274 70660 69871 69740 70059 69358 67513 67858 67188 68838 69496 69321 68774 68828 68797 68198 66729 67413 68359
713160 68912 69446 69147 69010 69379 69775 69546 68782 68974 68306 68160 67824 68978 69439 69222 69243 69106 69529 68738 68993 69154
693604 68016 68219 67221 67002 67148 66599 65612 65533 64617 65060 66531 67334 66113 66677 66512 67215 67307 68790 68052 65809
674810 65917 66562 68035 68131 66910 66733 67839 68661 68139 66875 66856 67547 68914 69285 68375 67804 67532 67856 67833 66837
655846F6078l34K19O45R16J427j014n34k805j6K19J980J246L23o88j146r45J19F5481
637673F6441J210n97N07M76j233j383o52m15J069P74j152q1J33r62j684j145Q70F2610
619343F3607J75j047l05R02J895J558K82p43m19n80K69J23r10j100P95K262j83F5794
600856F4296m90J224p95l29l03O39K85j556L19P22J379O64j715N67K74L46o80F5214
582209F5562j051j131q35j141j786l775j200K583L558q20n459l280J540N392L343F2917
565390F3294K07o68R81k86J047J528Kq20K54P14n05l88M09q89p68J48k56L59k47F3720
544432F3945q78K65k659J242J5J264J44m94J066K54k79Q11j539Q47K71N74O43F4500
525299F5377j087p1o51N28m39O1k67O78j035J004r50l07J90J07j031O3J08j54F2138
$$ plain form
655846 66078 65744 65963 66608 67524 68951 67937 67403 64598 64582 64801 66781 68027 68350 67662 66516 65571 65690 65481
637673 66441 67651 67054 67561 68037 66804 65421 64769 64354 65423 66197 65045 64964 65097 64135 62451 61306 62176 62610
619343 63607 63782 62735 62430 63332 65227 66785 67067 66324 65905 65325 65594 65717 64807 63707 64502 66764 66581 65794
600856 64296 63806 65030 64235 63906 63603 64242 64527 62971 63290 64012 65391 66055 64340 64907 65181 65527 64847 65214
582209 65562 64511 63380 62545 61404 59618 55843 54643 57226 60784 59964 54505 51225 52765 58157 61500 62917
565390 63294 63501 62833 63814 63528 64575 66103 66105 65285 65539 66253 65748 65360 65769 64880 64112 64260 64004 64363 64116 63720
544432 63945 63067 63332 60673 61915 61930 63194 63338 62844 63910 64164 63885 64696 63157 64004 64275 64849 65492 64500
525299 65377 64290 64219 63568 64096 63657 63718 63451 64129 63094 64098 63148 62841 63031 63138 62107 62170 62278 62124 62138
504978F1919j018m72j329J498q5J90l18j266p3o99K7m49K36N28N17K13q5j135E7648
484471E6659J400j27p58m53j77N43M59k32j813l22j089k11L84p1j65K173L38R16E6892
463773E6054l66N56R49P34j2l67r54l8j71j836p62N28P85J085O95q29j448q93E2331
442887E2890R71J587p88l03K3k36J250l38j10j65j09j50j34J84k9l63J92r81K57E3278
420750E3723L02M03l71N99o04k58L55k82k78J5k96P0j87k72q97j421m05O54k65E1375
398399E2481J125P45J17j075J90L21J799J9N42o67m43Pj198o03j071k50l53J252E2465
376908E1674L9Q73L46Q87P11n99n11R77P76L55J4J607M987J8715L4626J9406j5304H2189
356307F0761n634j761r35Q04Q475J9717K1171Q015r649r089L583N408n523j4504F7622
$$ plain form
504978 61919 60901 60429 59100 60598 60513 60703 60385 59119 59046 58347 58374 57925 58161 58689 59206 59419 59334 58199 57648
484471 56659 58059 57932 57174 56721 56544 57087 57546 57314 55501 55179 54090 53879 54263 54192 54027 56200 56538 57454 56892
463773 56054 55688 56244 57193 57927 57915 57548 56594 56556 56385 54549 53787 54315 55100 56185 56880 56051 54603 53710 52331
442887 52890 53861 55448 54660 54357 54380 54144 55394 55056 54946 54781 54672 54522 54388 54572 54543 54180 54372 53391 53648 53278
420750 53723 54025 54428 54057 54656 54052 53794 54149 53867 53589 53604 53308 53378 53191 52919 52022 50601 50196 50850 50585 51375
398399 52481 53606 54351 54468 53393 53583 53904 55703 55722 56264 55597 55154 55161 53963 53360 52289 52039 51686 52938 52465
376908 51674 51713 52586 52932 53819 54530 53931 53420 54397 55173 55528 55542 57149 62136 80851 115477 134883 119579 82189
356307 60761 55127 53366 52431 53235 61710 81427 102598 110613 100964 91875 95458 100866 95343 80839 67622
338818F0050l498j312j455j160N14l32L44P20L76J44N00L03J241m63j25n43j103E4651
317878E6118K577K623L560Q307M1607K33998M27593K72576j93403m53857k60024H1709
303445F9122o890m908j817k272l078q47l51J039l53Q35R83o7K09J86J418J42j366E1344
282192E0217Q89R56K77k3J24J87n74J465j586m09J17j068k15o3O83j09L15M74E0612
259616E1242QN87K98M88o22L0L92k1k53j56J160l21J049k44K28q31K38o80K00E3224
235683E3829L13j143L90j84j69l92N15N64l09p37j095j081N22J734O63K17J71E3708
213825E3470Q66o42j042m69Mk44k00K42R78J213N149J4300K7239L9676L0122J2414A66362
192935A30770l8165k4021r732k381j229O0P75m07k40J48m03M86N80o05m65j046E3706
$$ plain form
338818 60050 56552 55240 53785 52625 53139 52807 53151 53871 54247 54391 54891 55194 56435 55972 55847 55304 54201 54651
317878 56118 58695 61318 64878 73185 114792 348790 776383 1048959 855556 401699 141675 81709
303445 69122 62232 57324 55507 53235 50157 49310 48959 49998 49645 50480 51463 51396 51605 51791 53209 53351 51985 51344
282192 50217 51106 52062 52339 52316 52440 52627 52053 53518 51932 51523 51640 50572 50357 50294 50977 50868 51183 51657 50612
259616 51242 51250 51837 52135 52623 52001 52031 52423 52402 52149 51993 53153 52832 53881 53637 53865 53034 53272 52592 52792 53224
235683 53829 54142 52999 53389 53205 53036 52644 53159 53723 53414 52677 51582 50501 51023 52757 53420 53637 53808 53708
213825 53470 54336 53694 52652 52183 52187 51943 51743 51985 52963 54176 59325 73625 100864 140540 170662 183076 166362
192935 130770 92605 68584 58852 56471 55242 55302 56077 55670 55430 55578 55175 55661 56241 55636 55171 54125 53706
171868E3727r20q95K02P43J093j27N47J23m84m0Q83m51j039Q78K068K619J611F1260
149435E9415J528J5839L4927L9813K5131k481k8691l6314k8347j7674o873k037E4925
132775E5417k82L43P95j179p1j799K13m59k11K7M6Q83O84k46p5j82N0n69N36J0E4457
106372E3685k38o34l1n95o70J92P03K40l15M86Pr8J381O89l68L20j019o13K98E2909
80909E3057N9O15r0J098l63K90J014n49j69M74E5135
$$ plain form
171868 53727 52807 51912 52114 52857 53950 53823 54370 54493 54009 53969 54852 54401 53362 54240 56308 58927 60538 61260
149435 59415 60943 76782 111709 151522 176653 174172 145481 109167 80820 63146 56273 54236 54925
132775 55417 55135 55478 56273 55094 55023 53224 53437 52978 52767 52794 52840 53723 54407 54161 54086 53904 53954 53385 53921 53931 54457
106372 53685 53447 52813 52782 52187 51517 51709 52412 52652 52337 52823 52830 52732 54113 54802 54434 54754 53735 53122 53420 52909
80909 53057 53116 53731 53641 54739 54376 54666 55680 55131 54962 55436 55135
66244E4363  $$checkpoint
##END=