##TITLE= Raman spectrum of Aurichalcite � http://rdrs.uaic.ro
##MINERAL= Aurichalcite
##CHEMISTRY= (Zn,Cu)5(CO3)2(OH)6
##JCAMP-DX= 5.01
##DATA TYPE= RAMAN SPECTRUM
##DATA CLASS= XYDATA
##ORIGIN= Department of Geology, UAIC, Romania
##OWNER= http://rdrs.uaic.ro � stud. Apopei Andrei Ionut
##LONGDATE= 2010/02/14 19:43:30.0100 +0200 $$ export date from JSpecView
##XUNITS= Raman shift (1/cm)
##YUNITS= Intensity (cnt)
##XFACTOR= 3.188909E-3
##YFACTOR= 4.04494582E-3
##FIRSTX= 3399.61
##FIRSTY= 5.62813849
##LASTX= 210.701
##NPOINTS= 1024
##XYDATA= (X++(Y..Y))
1066073A391L4240o476N553O389M138K2920J4559n831J4558K1892Q770n058j971A44171
1054452A50819J6555J0122J9256N042J4497j0975m89K083L692q143j0973k290q721A64871
1042755A72359m926q463r943J2956j1100P875r684l188O075k030k7693K8073k5571A38020
1030983A33998l5476J2959L0k5054J0064L118j1610o015j384J3732k0293j7656E7796
1019926D9467J6306l569R617l2899J1547P174j1029j1608o591J7852k6208N438B7719
1008800B4281p811J708P498l502p489l050K417q64Q078R364k4726N570J3739p809B1237
996005A4845P435k0478J4768n877K355P952o328j181j0250P309r929J2457R180F27
983929A9748n473L662o628j1193P487O63M328J368J0240O252k9899J3994l186D381
$$ y = [1391, 35631, 29155, 34708, 41097, 45235, 68155, 82714, 76883, 91441, 113333, 122103, 117045, 115074, 144171, 150819, 167374, 177496, 196752, 201794, 216291, 205316, 204827, 206910, 210602, 202459, 191486, 189196, 180475, 164871, 172359, 167433, 158970, 149027, 161983, 150883, 158758, 149074, 145886, 151961, 149931, 122238, 150311, 124740, 138020, 133998, 98522, 111481, 111511, 86457, 96521, 99639, 88029, 82014, 80630, 94362, 74069, 56413, 57796, 49467, 65773, 62204, 71821, 38922, 50469, 57643, 46614, 35006, 28415, 46267, 20059, 25497, 27719, 24281, 16470, 18178, 25676, 22174, 14685, 11635, 14052, 13188, 21266, 30630, 5904, 11474, 25213, 17404, 21237, 14845, 22280, 1802, 16570, 10693, 13048, 21000, 14672, 13491, 3241, 10550, 621, 13078, 22258, 627, 19748, 14275, 17937, 11309, 116, 7603, 8266, 12594, 13962, 24202, 30454, 555, 14549, 11363, 4381]
971774i1J6314m977m591o328J3154j0849k267J3890Q94j3711J0386j0589l59J565E936
958720H06R343r631o90J2936n914o171O165P310j952M351j4000Q270O150M801h90
945574B1328M289N247j8039j0452L950O477j3525J5908l109L900r739n621J3830A014
933169A1639j1381Q925r472N614n919O930O696j0802r76J3947j4002J0945j1588A7500
920682A1347p309q28J4116p239r298O416J0259j6436P727k416m796J3197j4006A8134
908113A1028j0708M475k611J6943j8438J2013j317J899j1159j362O848o701N50A0757
895460A5422j5145O831o259J998J1988j2904J1830j3718L715K2883j5259l489A252
883578A0717J5115J287k6181J5423O345N829j5653j1859K2532k2656J6838J305B4399
$$ y = [-91, 16223, 11246, 6655, 327, 13481, 2632, 365, 14255, 15149, 1438, 11824, 1235, 876, 2441, 5936, 806, 10149, 518, -172, 12764, 6850, 679, 6844, 14154, 12202, 16553, 2553, 10823, 16973, 21774, -890, 21328, 25617, 30864, 12825, 2373, 6323, 12800, -725, 15183, 12074, 15974, 6235, 614, 14444, 1014, 11639, 258, 9183, -289, 5325, -594, 6336, 13032, 2230, 1254, 15201, 1199, 12144, 556, 17500, 11347, 4038, 3210, 17326, 10087, 789, 7205, 17464, 1028, 8755, 6339, 1543, 14740, 734, 18134, 11028, 320, 4795, 2184, 19127, 689, 12702, 11385, 13284, 2125, 763, 7611, 910, 1460, 10757, 15422, 277, 7108, 849, 2847, 14835, 1931, 13761, 43, 3758, 26641, 11382, 7893, 1252, 10717, 25832, 27119, 938, 16361, 22706, 28535, 12882, 1023, 23555, 899, 17737, 19042, 24399]
871621A4255j4003J6013R868k3837j519R561r863O917o590J7681l867p854o247H820
858729G771o390J3299o609k487m866N320L125q132J7202j7567O898m92n616J3724A36
844881A0277P183j6424k14J7858K369j5642m965K2931k2684J6755j5132j044R865B3617
831814C3721l3121J0413r364j002L889m058Q242J2617j4528o167O174k727l498I04
818656H956q223L953l712J8383k758Q43j2534n06l346J3726k933j1615J6393j5353A6495
804529A186K2140k3196J2348R61m441Q935j8164J0850P634k335o62J4969k9862A2678
791192B1461K287Q655l1772R598r569K2088l367K872j1344j0318R720l043p480G228
777764A1955M16j1969K4321k4628L102L430P226K722m546j1880N382n134K221E90
$$ y = [14255, 252, 16265, 26133, 2296, 777, 10338, 475, 7392, 802, 18483, 14616, 6762, 515, 8820, 7771, 1381, 14680, 8071, 5584, 718, 6038, 9163, 1031, 18233, 666, 7564, 7072, 1456, 15180, 136, 10277, 17460, 1036, 822, 18680, 21049, 5407, 442, 23373, 689, 17444, 2312, 1268, 11133, 23617, 33721, 600, 11013, 1649, 647, 4536, 478, 8720, 21337, 6809, 642, 6816, 4089, 591, 904, 8956, 733, 4686, 974, 19357, 16599, 17442, 4908, 4402, 1056, 14782, 11849, 234, 16627, 1274, 16495, 1186, 23326, 130, 12478, 13439, 8998, 17933, -231, 10619, 18253, 15918, 15256, 30225, 363, 12678, 21461, 23748, 32403, 631, 10229, 660, 22748, 19381, 22253, 10909, 591, 10311, 7268, -212, 7228, 11955, 12371, 402, 24723, 95, 3197, 6627, 13853, 16575, 12029, 149, 5531, 397, 2618, 590]
764252A9361k199J6130r921j5906o193R57K1443j9400l155M416J5222j9771J2999D480
750645b63M625l682L843M93K1075j6747q967J6560j7124P001M212j709q036J2133B3038
736032c03L0255k8151K206k866J8045r375r339K461k243R025r305M121j774j336I365
721316B835M815n231j372Q591r071J2699n247o472O012o488K1210k0538J5265F92
707424B8520k6362L915K454p644P5J037O141p369N540M939P835j363j6734M634A081
692500A8153m285k549j0398J0635j1030N77L2439l2896L085J7880j160j9901O862A8584
678414H786m588l251J1113J0661q958j3508J5897j4677L99J878P83J618n015J1050D72
663286C726l208O989n382N76Q490r005j157J6347j4501k148Q088p122K828J7854G166
$$ y = [19361, 17162, 33292, 23371, 7465, 1272, 2229, 23672, 4272, 1117, 5533, 20755, 984, 13983, 4480, -263, 4362, 680, 4523, 5016, 26091, 9344, 377, 16937, -187, 6814, 11026, 9317, 1281, 13414, 23038, -303, 29952, 1801, 4007, 1141, 19186, 9811, 472, 2933, 690, 9715, 410, 4531, 2757, 1421, 9365, 2835, 7650, 2419, 1047, 9638, 567, 13266, 8019, 1547, 7559, 1071, 22281, 1743, 17008, 692, 28520, 2158, 6073, 8527, 883, 958, 1995, 8136, 767, 6307, 11246, 19081, 17718, 984, 5618, 1081, 18153, 13868, 11319, 921, 11556, 526, 1103, 33542, 646, 3731, 21611, 20451, 550, 7412, 18584, 8786, 4198, 947, 12060, 22721, 13763, 255, 16152, 1475, 1874, 3752, 4535, 6153, 1138, 12188, 472, 3726, 518, 7507, 2125, 2701, 11191, 2186, 1029, 17376, 2875, 727, 8815, 1693, 4521, 22375, 7166]
648046F12L4036l4394K2359K573k4611Q472K040j0397J5960j6457J4968j4182A1381
634621G39J2668j2566P660j854o933J4505q10n698o794K1253p581n05m42j4089B2490
619174A2048j1791N59K3944Q953l2343J0866j0796K551J3096j1731n496J116J2959A30
604592A3359j3144R744r201N561O872k391m195n997P134q039J9379j9151K8133A3415
589913C32L092J8271m241k441j4727J7831p40j7912J6782K984k807Q642k4999E155
575131I98K976l972J1178M104N712j877M492k3124J3572j3765J5136j4381J1370E29
560251E462N190j0055J4062q030o303J1245r021M296o761M691R605j4276J0463C598
545268H73K790Q159N68j2168O834n303k216K3737j5384o060Q687q591J3842J7310A6234
$$ y = [612, 34648, 254, 22613, 25186, 575, 9047, 11087, 690, 16650, 193, 15161, 979, 11381, 739, 13407, 841, 8501, 6647, -286, 14219, 13409, 7711, 917, 22170, 14589, 14084, 13642, -447, 22490, 12048, 257, 816, 24760, 33713, 1370, 12236, 1440, 3991, 17087, 5356, -140, 976, 13935, 130, 13359, 215, 9959, 758, 6319, 13191, 10800, 6605, 608, 7742, -297, 19082, -69, 28064, 13415, 332, 3424, 21695, 17454, 15013, 286, 18117, 17377, -535, 16247, 19231, 16424, 25066, 67, 5155, 998, 3974, 2, 11180, 15284, 20996, 19119, 23611, 487, 14059, 294, 15430, 1049, 12419, 529, 5462, 10652, 597, 14659, 6629, 326, 11571, 2550, 6846, 85, 4776, 14381, 105, 10568, 3598, 873, 3663, 11822, 12390, 222, 7056, 1753, -463, 23274, 7890, 1830, 10517, 1926, 15768, 33078, 16234]
529172A5214j4785O093n430N684l9Q836j5605P148L132p865k182J5072r434o090A3990
512959C53N915m645k652Q63K0688j1087r555L230k837J6840k263j5213K8138k865D31
496628B1517L349k5012J853j865K4263j4516r563P012o151J9024j826j6942o04A2940
481208D437P320J6904K1278L5494K3722k3681L6845N070J276l5324j0301j3389G0348
466724H3846j6862L5174n476j2037j1330j4995j6797l867R56J3050j6538J3628A9093
452142C69J0195k848l180J849L843j0057M809M746m927j20n157J8861j9216J3042b81
435365H521q51M6k821M041J021r521m64J0371M510l334j1630J3608j1698j240A3828
418463I468r400K0954k1113R844r659M780m997J1102N452j6995J3048r064l623A9975
$$ y = [15214, 429, 6522, 1092, 6776, 6737, 15573, -32, 7116, 10248, 2383, 201, 15273, 5839, -251, 13990, 353, 6268, 1623, -1029, -166, 20522, 9435, -120, 3110, 273, 17113, 14850, -363, 27775, 24910, 431, 21517, 24866, -146, 1707, -158, 24105, 9589, 26, 7038, 887, 19911, 18085, 1143, 539, 12940, 4437, 11757, 28661, 49939, 85433, 109155, 85474, 122319, 127389, 128665, 93341, 83040, 69651, 70348, 83846, 66984, 102158, 96682, 84645, 73315, 58320, 41523, 37656, 38612, 51662, 35124, 48752, 19093, 369, 10564, 7716, 4536, 6385, 10228, 171, 4980, 9726, 4799, 4679, -478, 18383, -833, 12209, -281, 8521, 7670, 7716, 4895, 8936, 9957, 436, -28, 10343, 14853, 11519, -111, 13497, 1799, 559, 13828, 9468, 68, 21022, -91, 9753, 94, 4874, -123, 10979, 16431, -564, 12484, 3420, -203, 19975]
402504A7Q560K1162l0131K1663q634j2622L720l951J056J0756P995q634j1075A3970
386433G731k356n573J5733j0096M001r568J988j998J001m68J911n35L029o27l844F06
368085F733N032j14j1857M910m737J1890L016j3335k266R311q132M730M86n767G716
350684H282N745j3803L485J6543M258Q181J0047o676L7706L9828J40299L04060H73918
335353I98971j96681k81839j27533q1093n0413p5689k5069o0960j6963k5133j7928E4546
321028F0482J0824k1272k168m805J8929k1592K2210j8890m482K1568j1879M652B9928
305502D5129K788k1847n960m930J9962l5161J0399N3l743J660J1694k0725J6690A9959
288755G507P359j1553l255K5548k1670m238N4J8700j493m003J914r215k848k914B778
$$ y = [17, 8577, 29739, -392, 21271, 12637, 15, 3735, -216, 840, 11596, 19591, 10957, -118, 13970, 7731, 5375, -198, 15535, 5439, 9440, -128, 1860, -138, 863, 395, 2306, 1771, 4800, 4173, 329, 606, 6733, 11765, 11651, -206, 4704, -33, 11857, 14873, 1538, -728, 8583, 451, 5181, 5667, -100, 7716, 8282, 14027, 224, 3709, 20252, 24510, 32691, 42738, 36062, 73768, 113596, 253895, 557955, 873918, 998971, 802290, 520451, 392918, 311825, 261412, 185723, 160654, 99694, 82731, 57598, 39670, 54546, 60482, 71306, 50034, 47866, 43061, 61990, 40398, 62608, 43718, 39236, 60804, 48925, 53577, 29928, 45129, 47917, 26070, 20110, 15180, 35142, -19, 10380, 10433, 6690, 8350, 20044, -681, 16009, 19959, 7507, 14866, 3313, 58, 25606, 3936, -302, -248, 18452, 16959, 12956, 14870, 5655, 2807, -107, 2778]
270762c1J0083p445l006Q636q108J2705j2837K6795j9451p936J0807R492j9777I471
253770A4836o530q523L192L702J01Q847N311K545J1228k794P177R042p35L8630A15397
235514A15948Q528P178L0525K1264j9451K5445l6753m6723n686O021L1942j7907A19985
219426I3588k1958m4471j4239J969O19J970j0701j246j439m273M66P927P670j6129F428
200910d47J5748m708n549n252Q252J883r693k36Q410k682l64n574P081O018j2316A2303
181083g16L580k755J0988N458P901L336j1844J3756P517J2471L595j0362K9517H7873
163457G7833K3987J8005N784K9392Q165l605P781j8978j8397N080J5758J4408A76790
146892A76984L1647J9747P527l8976l3766K705k2252R202j8970J3061j4081o490I2640
$$ y = [-31, 10052, 2607, -399, 8237, 129, 12834, -3, 26792, 7341, -595, 10212, 19704, -73, 9471, 14836, 8306, -217, 2975, 6677, 6778, 15625, 20936, 23481, 34709, 31915, 39092, 48134, 47399, 86029, 115397, 115948, 124476, 131654, 162179, 183443, 163992, 189437, 152684, 105961, 100275, 106296, 138238, 120331, 119985, 93588, 71630, 27159, 12920, 14889, 15508, 17478, 6777, 5531, 4092, -181, 285, 8212, 15882, -247, 6428, -447, 15301, 10593, 5044, -208, 8044, 9927, 234, -2, 8408, 5726, 5362, -212, 6869, 12887, 571, 12303, -716, 2864, 109, 11097, 16555, 24456, 27792, 15948, 29704, 37221, 49692, 53287, 42925, 72442, 87873, 77833, 101820, 119825, 125609, 155001, 163166, 159561, 167342, 148364, 129967, 135047, 150805, 165213, 176790, 176984, 208631, 228378, 235905, 196929, 163163, 165868, 143616, 152818, 133848, 146909, 132828, 126338, 92640]
130217I3932k759L0110L0496K1941N8412K5159J2809k4045l1250n1446m9902m1154G3408
113430F2229P602j2014q476k6165p447J5710j5164j6707P182J6307J5213o141C8016
96531E5802Q267J7399K1131J5664K734L3545l7081k3316r96k3444k8719l4251E546
79520D7K9964j6860L5626J5493K5013J7230L3632M9262N267B27212
$$ y = [93932, 91173, 121283, 151779, 173720, 232132, 257291, 270100, 246055, 214805, 163359, 113457, 72303, 73408, 62229, 69831, 57817, 49341, 23176, 15729, 31439, 16275, -432, 6750, 23057, 38270, 32129, 38016, 55802, 64069, 81468, 102599, 118263, 120997, 154542, 117461, 94145, 93149, 69705, 40986, 6735, 5546, 47, 30011, 13151, 48777, 64270, 89283, 106513, 140145, 189407, 194674, 227212]
66073B78597  $$checkpoint
##END=