##TITLE= Raman spectrum of Azurite � http://rdrs.uaic.ro
##MINERAL= Azurite
##CHEMISTRY= Cu3(CO3)2(OH)2
##JCAMP-DX= 5.01
##DATA TYPE= RAMAN SPECTRUM
##DATA CLASS= XYDATA
##ORIGIN= Department of Geology, UAIC, Romania
##OWNER= http://rdrs.uaic.ro � stud. Apopei Andrei Ionut
##LONGDATE= 2009/10/19 00:48:04.0060 +0300 $$ export date from JSpecView
##XUNITS= Raman shift (1/cm)
##YUNITS= Intensity (cnt)
##XFACTOR= 3.188736E-3
##YFACTOR= 1.29644347E-4
##FIRSTX= 3399.97
##FIRSTY= 0.10987412
##LASTX= 211.234
##NPOINTS= 1024
##XYDATA= (X++(Y..Y))
1066244H48K250j274L146M0l818K022J928j261l865P664l051K959L115k832j087I701
1053066A3360j14q820O20M288n671Q534l265m444M79k372K971l142O215j570M28A6865
1039791A0671K328O48o049N49m643Q896p667J1307k246N106p110J162k65M243p303A3524
1026419A1394l976Q310p081q676N701P62M938jp113P598k860P672L93M066m550A4363
1012950A1978m564P390l235Q59M618o591L440p46J676l846P49M007l606l943K241A1076
999380A8829o130M654J139l044l884O30q739P063J542l00K373k145p247R558m074A3424
985710A6203n250j155q097O200K854m673L436M438k002K010l844K259J672k677F354
972755A5716k596o193J415J1114q955O60p535K582N926n865J326q48L917J4202A2644
$$ y = [848, 3098, 1824, 4970, 5010, 1192, 3214, 5142, 3881, 16, 7680, 4629, 7588, 10703, 7871, 6784, 9701, 13360, 13246, 4426, 5046, 9334, 3663, 12197, 8932, 4488, 4967, 2595, 5566, 2424, 8639, 7069, 7497, 16865, 10671, 12999, 13647, 7598, 8147, 3504, 12400, 4733, 16040, 13794, 18900, 11790, 12952, 12687, 16930, 9627, 13524, 11394, 7418, 15728, 8647, -29, 5672, 6434, 11372, 11371, 4258, 11856, 8996, 16668, 17061, 21127, 16577, 14363, 11978, 7414, 14804, 11569, 12428, 17046, 10455, 13895, 13149, 14825, 10979, 11728, 15735, 12129, 8186, 10427, 11076, 18829, 12699, 17353, 18492, 15448, 11564, 12194, 3455, 10518, 12060, 11760, 14133, 11988, 4741, 14299, 10225, 13424, 16203, 10953, 9798, 1701, 7901, 10755, 6082, 9518, 13956, 11954, 13964, 10120, 12379, 14051, 11374, 6354, 15716, 13120, 6927, 8342, 19456, 10501, 11161, 3626, 6208, 12134, 6269, 7595, 6747, 10664, 24866, 12644]
959706A4051p874K745N922p625J323J52M02J072j939L245j82k441k66L329O54A2052
945742I863O842j603m864K579J157k689K496o283O009o785J077O344l103L921A7210
932507A3439k767p950J0362k597K671J63k010j173L761M012r616O69M852N855G633
919179A1483k671J678P59k250m758N361M023r855L607J017K689M029r099K609A4744
905757D144M535k571M537o248J0476q170L204k064L122J13r837N718P223M382A3916
892241A3366K879p153M136p737L553p066N646L556L557n974M7M982l881N52M400A2072
877774H446o98K314Q93k6K26q60k197L12o89K31L15J655L746J071l694j017n449E236
861482G149N75Q520n193m690M342J249k179K756Q33r21k176j003j672J256L263F008
$$ y = [14051, 6177, 8922, 14844, 7219, 8542, 8694, 9096, 10168, 8229, 11474, 11292, 8851, 8585, 11914, 12568, 12052, 9863, 16705, 15102, 10238, 12817, 13974, 11285, 13781, 7498, 13507, 6722, 7799, 14143, 11040, 14961, 17210, 13439, 10672, 2722, 13084, 10487, 13158, 13321, 11311, 10138, 13899, 17911, 8295, 8964, 13816, 19671, 7633, 11483, 8812, 10490, 11249, 8999, 4241, 9602, 13625, 3770, 7377, 8394, 11083, 15112, 6013, 8622, 14744, 4144, 8679, 6108, 10645, 4397, 14873, 6703, 9907, 7843, 10965, 11078, 1241, 6959, 14182, 18564, 13916, 13366, 16245, 9092, 13228, 5491, 9044, 1978, 7624, 11180, 14737, 8763, 8810, 13792, 9911, 10463, 14863, 12072, 8446, 7748, 10062, 10955, 10929, 11155, 10295, 8098, 8410, 7721, 7952, 8267, 9922, 13668, 14739, 11045, 10028, 4579, 5236, 7149, 7724, 16244, 11051, 6361, 10703, 11952, 9773, 12529, 13362, 12441, 10265, 9262, 7590, 8846, 12109, 6008]
846787F598N523j081m927L41Q203m925J514p348N446J266J016p011m502J3644G919
832854H437k409M783m163M032Q55l409M786p337R971m577J862o1j482Q60j0344H184
817945I129K200q921N295j562r76L540j142k982J0314j2847J1736j809n55P724F632
803811A0928l480J956q915J0150j723M131p075N302M047l00j0920O055m564K209H337
789573A2386k99p992J122M718m312O976k975l392P394j3761J2830m814k389N388A0916
775238A2624j0918R56N304J123k472P645P88p908Q230o988L715n400N053k975G557
760800A1857K376k892j805J707j220Q70l059J371k391J538L546N34o36j974M381H465
745345H079K206M882K707j4770O052P807m987K037n071K371L124j476J116m487B6844
$$ y = [6598, 12121, 11040, 6113, 6454, 14657, 9732, 11246, 3898, 9344, 10610, 11626, 4615, 113, 13757, 7919, 8437, 6028, 10811, 6648, 10680, 11535, 8126, 12912, 5575, 15546, 10969, 12831, 12770, 11288, 12148, 1804, 8184, 9129, 11329, 2408, 7703, 6141, 5165, 8705, 7563, 4581, 14895, 2048, 13784, 11975, 11420, 19144, 6632, 10928, 7448, 9404, 489, 10639, 8916, 13047, 5972, 11274, 15321, 15021, 4101, 10156, 5592, 7801, 8337, 12386, 12087, 4095, 5217, 9935, 5623, 12599, 9624, 6232, 13626, -135, 12695, 7881, 5492, 10880, 10916, 12624, 1706, 2662, 7966, 9089, 6617, 14262, 15050, 7142, 15372, 8384, 12099, 6699, 11752, 8777, 7557, 11857, 14233, 11341, 9536, 11243, 10023, 10893, 7834, 9205, 6814, 8352, 11898, 12432, 11796, 9822, 14203, 8465, 8079, 10285, 15167, 17874, 3104, 9156, 16963, 11976, 14013, 8942, 11313, 14437, 12961, 14077, 9590, 26844]
730694B3945j477J783j4689q10n58J3071p751l235k817K450K534p334L620O045A4968
715939A3403m492N291L451J109o332M788J360p839L533P045n582K780m746K444A5397
701074A7841M534j2022N203L614m163M784j0769J0052m916J0636k408P375j4617B1181
687047A2668Q52L276L444l580p093R548j992r267P289K607k996k37L944l331J937A9173
671031A6427l414J100J519r185P288j0355P873L442O82K689n673j994m669N950A4537
655846A3128k411M947k328M947n170p595N532M614m000n086M112J185l580L527I663
640552I678L445K524l830m02r03k33L529j488j821j571Q214j1939m579O876K71D112
624181D802N707J360n664L869J528J947l488k316k26N377k25o328M125J533L206G041
$$ y = [23945, 22468, 24251, 9562, 8752, 8194, 21265, 13514, 10279, 7462, 9912, 12446, 5112, 8732, 14777, 14968, 13403, 8911, 14202, 17653, 18762, 12430, 17218, 18578, 10739, 14272, 21317, 15735, 18515, 13769, 16213, 15397, 17841, 22375, 10353, 15556, 19170, 15007, 19791, 9022, 19074, 14158, 24794, 22386, 29761, 15144, 21181, 12668, 13520, 16796, 20240, 16660, 9567, 19115, 17123, 7856, 15145, 17752, 14756, 14519, 18463, 15132, 17069, 19173, 16427, 13013, 14113, 15632, 6447, 13735, 3380, 11253, 14695, 15377, 18066, 12393, 10399, 5730, 11680, 14537, 13128, 10717, 15664, 13336, 18283, 13113, 5518, 11050, 15664, 11664, 6578, 10690, 11875, 8295, 11822, 9663, 9678, 13123, 15647, 11817, 11415, 10512, 10279, 13808, 12320, 10499, 8928, 17142, 5203, 624, 7500, 7771, 4112, 4802, 10509, 11869, 6205, 10074, 11602, 13549, 10061, 7745, 7519, 12896, 12671, 6343, 10468, 12001, 15207, 7041]
607686A1335k896M630P00o741J204l562O974K962M384N38q158J794k972n563R908A0313
591062A2111O899o25j23r822M394l967K557l5k85j287P911K645o720j953m794A2146
574309A0866P082p801p047J0179l031l198j942M664m616L496k439o118K830K414I927
558425E654m189O097l016l516K923M011k844J840M015n516L432n514O445p6n510B406
541421G769M528r603O621o7j404O88k489J192J110J91o916J1399N29j559n238H288
524286A3421P476n232J207L717K799o649J0327m640p91J29r151P574o138j706A1392
508038A5292l960O411o632M991p717q59O083n707P256P089R850P677j938r964B1087
491668A2463j431m106K249o027P855l600J334l431J1288j0620J1623j3795q1j64A3512
$$ y = [11335, 8439, 13069, 13769, 7028, 8232, 4670, 11644, 14606, 18990, 19528, 11370, 13164, 10192, 4629, 14537, 10313, 12111, 19010, 18385, 18262, 8440, 12834, 8867, 11424, 11389, 11104, 9817, 17728, 20373, 13653, 11700, 6906, 12146, 10866, 17948, 10147, 3100, 13279, 10248, 7050, 5108, 9772, 5156, 8652, 6213, 95, 2925, 5339, 9927, 5654, 1465, 7562, 4546, 1030, 3953, 7964, 5120, 6960, 10975, 5459, 8891, 3377, 9822, 9746, 4236, 2406, 7769, 12297, 2694, 9315, 9248, 7844, 8532, 6043, 7235, 8345, 8536, 1620, 13019, 13548, 11989, 6751, 8288, 13421, 20897, 15665, 16872, 20589, 23388, 16739, 27066, 22426, 21635, 21764, 12613, 20187, 14049, 12343, 11392, 15292, 11332, 17743, 11111, 16102, 8385, 7526, 13609, 7902, 15158, 22247, 32097, 39774, 37836, 27872, 21087, 12463, 11032, 6926, 9175, 3148, 11003, 7403, 8737, 5306, 16594, 5974, 17597, 3802, 3721, 3557, 13512]
475182A1846p938M607q28J514r94K938J600L190m084J017j156r88L863J020J7B3251
457529B0092Q56j0600L281J610j818L115K364M789J277J0057K031l237q589o748A7919
440789A0586L620j898o664J614k985O297l152j563M039p166Q052l905J08M42n076D379
422867B396O796l239k821J2648j2271l14k405r84K778M784l412J438r05M948J017A1721
404806D457L439m09n761L017m008K596L683N019m264N84q39M177l769K083J664F808
386601I555l359k859L745m034M327k115M155m376k82n34k125M729p92P94o483A637
368256H110p996K454K6J194L366l494M948j660P618j0530m011M683J3459q43j77B6165
349762B2469J7206K4895P8240J13857P4722k8469j15350r4283m2777j2846j1429B4837
$$ y = [11846, 3908, 8515, 7687, 9201, 8207, 11145, 12745, 15935, 11851, 12868, 11712, 10724, 14587, 15607, 15624, 23251, 20092, 20948, 10348, 13629, 15239, 13421, 16536, 18900, 23689, 24966, 35023, 37054, 33817, 25228, 18480, 17919, 10586, 14206, 12308, 5644, 7258, 4273, 10570, 7418, 5855, 9894, 2728, 10780, 6875, 6983, 7425, 2349, 4379, 2396, 9192, 5953, 3132, 15780, 3509, 3195, 790, -194, 2584, 7368, 3956, 5394, 4489, 9437, 10454, 11721, 4457, 7896, 7487, 1726, 4743, 735, 3331, 7014, 12033, 7769, 8353, 7514, 11691, 7922, 10005, 11669, 6808, 9555, 6196, 3337, 7082, 3048, 7375, 5260, 9415, 5039, 4757, 4223, 2098, 6827, 6035, 6829, 346, 1637, 8110, 114, 2568, 2594, 3788, 7154, 3660, 8608, 6948, 14566, 4036, 25, 4708, 18167, 17324, 17147, 26165, 22469, 39675, 64570, 142810, 256667, 331389, 302920, 187570, 93287, 50510, 37664, 26235, 24837]
335522B2348n587o57l003J342j841J668O012o118j104l57j782l793O570j126l556A0556
316771A0921O95k905N703j326m090M937J0366l351M922m449J5031m45k037R747D6605
298986G9254K1105L6318L5477J1307j6543l0680l3277l3951n944j0715q964o209C6231
283316D1384l7k93m060J119l08j316P794K939m508L765N600M676J3702J0352L9112A71321
264149B45711M0938K8726l0984p0956o0091m2535k3893j6120j5204r773J511N771D5658
248249E0586N342Q767J3530J4948L8693L6347K6060k5870k6459k6796k1614j1499F5266
232245F1205j5938r919p078J031j3185K534j900J026m159L532L55j485l99o670H970
213825A5595j2104N707k486k652j982O130m821R897j2845P896p905k93R159r149A872
$$ y = [22348, 16761, 16104, 13101, 14443, 12602, 14270, 20282, 14164, 13060, 12703, 10921, 7128, 13698, 12572, 9016, 10556, 10921, 11616, 8711, 14414, 13088, 8998, 13935, 24301, 20950, 25872, 21423, 36454, 36009, 33972, 43719, 46605, 79254, 100359, 136677, 172154, 183461, 166918, 136238, 102961, 69010, 63066, 52351, 43387, 37178, 36231, 41384, 41347, 41054, 36994, 38113, 37805, 36489, 44283, 47222, 42714, 46479, 52079, 56755, 70457, 80809, 119921, 171321, 245711, 286649, 315375, 284391, 213435, 153344, 110809, 86916, 70796, 55592, 45819, 47330, 53101, 45658, 50586, 55928, 64695, 78225, 93173, 131866, 168213, 194273, 168403, 141944, 115148, 93534, 82035, 65266, 61205, 45267, 35348, 28270, 29301, 16116, 18650, 16750, 17776, 13617, 17149, 17504, 16019, 15620, 8950, 8970, 15595, 3491, 9198, 6712, 4060, 2078, 8208, 3387, 13284, 439, 8335, 430, 137, 9296, 147, 1872]
195265B012O667m700J243n108n86L852m06P795p500L295n060M398J647M332J916A5891
175392B5688K0008L0222J5432J145j7154j6723k5825q501j1498r559R92O693k488E125
157723B839k770O781O967k963N669k421M960L393p957N947M969Q12P777K369P329F2931
137547H5368K6562L9302M5270P2894J00019J51394K21332J82067P5320o4451j56313F04596
122008D66339j02096o6765m7328m2015l5449k8381k4573l0046o835j6905R234H3210
106372H4518M874p782j373j4444L30K228k645J3553J4286K4131M3011N9130M6908C00657
88210B79804l4243l1076k4062m253L8301J02182J12965N5935m1564r7336q7803A96020
72365A74036k1808p30O890A53168
$$ y = [2012, 8679, 3979, 5222, 114, -472, 3380, 2974, 10769, 3269, 6564, 1504, 5902, 7549, 11881, 13797, 15891, 25688, 45696, 75918, 91350, 92495, 75341, 58618, 32793, 24292, 12794, 3235, 4227, 10920, 8432, 5125, 2839, 69, 6850, 13817, 10854, 16523, 14102, 19062, 22455, 14498, 20445, 25414, 26226, 34003, 36372, 43701, 62931, 85368, 111930, 151232, 196502, 269396, 369415, 520809, 742141, 924208, 999528, 935077, 778764, 604596, 466339, 364243, 297478, 250150, 208135, 172686, 144305, 119732, 89686, 82851, 65946, 75180, 83210, 84518, 89392, 81610, 80237, 65793, 66123, 68351, 65706, 79259, 93545, 117676, 160687, 219817, 266725, 300657, 279804, 245561, 214485, 190423, 186170, 224471, 326653, 439618, 495553, 453989, 356653, 268850, 196020, 174036, 152228, 151498, 158388, 153168]
66244A64683  $$checkpoint
##END=