##TITLE= Raman spectrum of Beryl (no. 1)
##MINERAL= Beryl
##CHEMISTRY= Be3Al2Si6O18
##JCAMP-DX= 5.01
##DATA TYPE= RAMAN SPECTRUM
##DATA CLASS= XYDATA
##ORIGIN= Department of Geology, UAIC, Romania
##OWNER= http://rdrs.uaic.ro � stud. Apopei Andrei Ionut
##LONGDATE= 2012/11/18 13:11:44.0688 +0200 $$ export date from JSpecView
##SPECTROGRAPHDATASYSTEM= HE 532 (Horiba Jobin-Yvon)
##XUNITS= Raman shift (1/cm)
##YUNITS= Intensity (cnt)
##XFACTOR= 3.188736E-3
##YFACTOR= 2.46135997E-3
##FIRSTX= 3399.97
##FIRSTY= 834.4889151
##LASTX= 211.234
##NPOINTS= 1024
##XYDATA= (X++(Y..Y))
$$ plain form
1066244 339036 343351 344847 345986 347936 350894 349252 349546 347536 345378 343809 342752 342260 342088 343080 344969 344759
1053066 342923 343697 343384 342682 344775 344707 347189 346385 347131 348157 349638 350984 351530 350650 350641 350051 350621 350933 349924 349884
1037439 349825 348700 349334 350649 350479 349194 347663 348762 348996 351503 351190 352521 354340 354591 355798 356335 354476
1024048 355498 355413 356455 357703 359226 358808 357222 356271 355995 356300 360198 360134 360530 359220 357920 356325 355787 357099
1009767 356576 356018 356257 356106 356672 358141 358831 357751 360059 360198 360830 361197 359629 362279 364443 367044 367403 366754
995369 366117 363032 364505 366079 366463 367301 366667 364099 363183 364859 365946 365228 367153 368398 366339 368613 368941
981671 369063 367557 368041 369630 371931 371781 374165 374082 374169 373840 375400 374799 375203 373118 372351 372742 373554 373301 373374
966242 371347 372075 372183 372126 372517 371556 373013 373813 374556 375901 377397 377913 377323 377587 378115 381522 379385 380074 381199
$$ packed form
1066244C39036M315J496J139J950K958j642K94k010k158j569j057m92j72R92J889C44759
1053066C42923P74l13p02K093o8K482q04P46J026J481J346N46q80rn90N70L12j009C49884
1037439C49825j125O34J315j70j285j531J099K34K507l13J331J819K51J207N37C54476
1024048C55498q5J042J248J523m18j586r51k76L05L898o4L96j310j300j595n38C57099
1009767C56576n58K39j51N66J469O90j080K308J39O32L67j568K650K164K601L59C66754
995369C66117l085J473J574L84Q38o34k568r16J676J087p18J925J245k059K274C68941
981671C69063j506M84J589K301j50K384q3Q7l29J560o01M04k085p67L91Q12k53C73374
966242C71347P28J08n7L91r61J457Q00P43J345J496N16n90K64N28L407k137O89C81199
$$ plain form
950684 380446 380480 381002 382270 380112 377928 378922 377517 378721 380690 380157 380969 380466 379160 378485 379396 380186 382269
935825 381139 379552 381213 382406 382170 382671 381380 383384 383370 383114 384630 386415 387661 386385 386248 386081 387221 386744
920851 386599 386037 385787 383459 381772 381161 381905 383401 382822 382921 385322 385525 385442 387460 387547 388015 390732 391794 392196
904913 393083 393768 392186 389938 389220 386602 383975 382911 386303 389629 394044 394217 394810 392950 393649 393764 393941
890544 392400 394839 394933 395681 398063 399240 399619 399640 397409 398372 399015 399456 398477 399877 400839 401324 401658 402166 398934
874356 397378 396464 397178 398282 399698 400847 401292 400246 400511 400812 404391 403854 404860 403011 403790 401693 403762 404230
858895 407314 409322 409653 408157 408567 408910 407539 405548 404778 404846 406190 406986 405266 405512 405917 407061 407570 407760
843312 409192 412161 413684 412268 412531 414292 414638 414647 412472 414950 418690 418149 416422 414238 415351 413878 412311
$$ packed form
950684C80446L4N22J268k158k184R94j405J204J969n33Q12n03j306o75R11P90C82269
935825C81139j587J661J193k36N01j291K004j4k56J516J785J246j276j37j67J140C86744
920851C86599n62k50k328j687o11P44J496n79R9K401K03q3K018Q7M68K717J062C92196
904913C93083O85j582k248p18k618k627j064L392L326M415J73N93j860O99J15C93941
890544C92400K439R4P48K382J177L79K1k231R63O43M41r79J400R62M85L34N08C98934
874356C97378r14P14J104J416J149M45j046K65L01L579n37J006j849P79k097K069D04230
858895D07314K008L31j496M10L43j371j991p70O8J344P96j720K46M05J144N09D07760
843312D09192K969J523j416K63J761L46Rk175K478L740n41j727k184J113j473D12311
$$ plain form
828482 412450 413529 416038 417005 418345 418428 418397 418019 417735 418375 418658 419826 420075 417724 419335 421518 422532 421799
812657 420445 419821 419535 420942 420675 421979 423757 420119 417437 417161 419314 421877 423975 422533 420783 423273 422624
797595 423812 424194 426664 423487 427913 427354 427647 428299 430089 428569 428055 426642 429443 427391 423736 422330 422199
782420 428251 427923 429585 429410 427828 428770 427217 428826 429365 426843 427943 426419 427620 429689 434068 435760 435684
767128 438658 440656 440999 442728 442245 440792 438595 438498 436775 438150 438661 437396 434355 432468 434086 437361 438265
751724 438814 436091 441446 440025 441507 441758 442285 444134 445352 449079 448625 450119 449780 452032 450179 448883 448232
736201 447326 448472 449600 450555 452157 454714 457060 456378 455597 453821 451366 451758 450973 451434 454211 454769 457054 456286
719636 455677 459065 457773 458231 456681 456648 455237 456068 453265 454721 453620 455668 456840 455881 456126 454813 452313
$$ packed form
828482D12450J079K509R67J340Q3l1l78k84O40K83J168K49k351J611K183J014D21799
812657D20445o24k86J407k67J304J778l638k682k76K153K563K098j442j750K490D22624
797595D23812L82K470l177M426n59K93O52J790j520n14j413K801k052l655j406D22199
782420D28251l28J662j75j582R42j553J609N39k522J100j524J201K069M379J692D35684
767128D38658J998L43J729m83j453k197r7j723J375N11j265l041j887J618L275D38265
751724D38814k723N355j421J482K51N27J849J218L727m54J494l39K252j853j296D48232
736201D47326J146J128R55J602K557K346o82p81j776k455L92p85M61K777N58K285D56286
719636D55677L388j292M58j550l3j411Q31k803J456j101K048J172r59K45j313D52313
$$ plain form
703871 452543 454144 454831 454455 457125 460017 459774 458441 458629 460535 461446 461442 458747 456989 460426 456699 456423 455246
687047 454790 455103 455158 456342 458758 458259 458656 459683 458214 459512 463839 464486 464501 464620 465391 467157 468426 468852
670087 469038 470213 470522 470880 468698 466760 469360 470307 474465 471152 467640 469294 469609 470784 470477 470781 471828
653943 472946 474413 475288 475415 477895 476203 473538 472326 470011 474532 475023 475310 476100 474020 470959 469581 470212
637673 471571 470833 470203 471413 473308 471664 471582 470215 472250 472898 474178 473711 471859 475081 472233 471077 469561
621281 469918 470864 470018 470195 467307 466784 468160 469673 474361 472020 474062 474669 473452 475003 474239 474293 475845 476841
603785 479961 482576 481034 478865 477921 479729 478286 475239 477305 478900 479561 479524 478347 477869 481722 480905 481419
587132 480785 481978 482883 481305 483114 483919 484355 484002 481947 480935 477645 473383 470860 473237 475505 473206 466900
$$ packed form
703871D52543J601O87l76K670K892k43j333J88J906R11mk695j758L437l727k76D55246
687047D54790L13N5J184K416m99L97J027j469J298M327O47J5J19P71J766J269D68852
670087D69038J175L09L58k182j938K600R47M158l313l512J654L15J175l07L04D71828
653943D72946J467Q75J27K480j692k665j212k315M521M91K87P90k080l061j378D70212
637673D71571p38o30J210J895j644q2j367K035O48J280m67j852L222k848j156D69561
621281D69918R46q46J77k888n23J376J513M688k341K042O07j217J551p64N4J552D76841
603785D79961K615j542k169r44J808j443l047K066J595O61l7j177m78L853q17D81419
587132D80785J193R05j578J809Q05M36l53k055j012l290m262k523K377K268k299D66900
$$ plain form
570351 464888 463570 468259 471106 473346 475463 475605 474573 475685 475930 477210 478478 478011 476918 477382 476135 474100
553439 476818 476029 474781 474431 473886 472119 472673 474325 469819 469379 470387 470850 467323 470284 471546 474727 476713
536397 477829 477841 479644 480276 478863 477273 478224 478676 479528 478801 478751 478631 477554 475017 477000 475327 476926 478303
518208 477948 478321 476765 477103 478488 479770 480265 478746 477602 476128 476144 473386 474390 473352 470494 469641 469883
500891 469727 467874 465347 465930 462997 463836 462401 462397 461779 465138 465669 465110 466901 466225 464027 464276 462305 461363
482407 462445 462208 461050 460473 461124 459738 461329 459409 460358 458407 461043 459720 460460 464231 467603 467947 467191
464814 465808 466979 467195 467791 469580 469063 468325 468776 467171 467500 463799 463471 461069 462336 463855 463570 462775 463463
446033 463633 462294 459034 461134 462263 463846 463102 461554 459123 462001 462018 459896 458319 456278 454987 456084 453750
$$ packed form
570351D64888j318M689K847K240K117J42j032J112K45J280J268m67j093M64j247D74100
553439D76818p89j248l50n45j767N54J652m506m40J008M63l527K961J262L181D76713
536397D77829J2J803O32j413j590R51M52Q52p27n0j20j077k537J983j673J599D78303
518208D77948L73j556L38J385J282M95j519j144j474J6k758J004j038k858q53D69883
500891D69727j853k527N83k933Q39j435mo18L359N31n59J791o76k198K49j971D61363
482407D62445k37j158n77O51j386J591j920R49j951K636j323P40L771L372L44D67191
464814D65808J171K16N96J789n17p38M51j605L29l701l28k402J267J519k85p95D63463
446033D63633j339l260K100J129J583p44j548k431K878J7k122j577k041j291J097D53750
$$ plain form
428154 455628 454378 454347 454673 453821 453991 455043 455138 455325 456362 456872 456730 457339 457493 455818 457436 457973 457012 454906
408005 456597 455945 456520 455711 454367 453647 456296 456777 459266 461344 461952 465499 465391 467096 469754 476670 484749 489838
388753 487424 481363 472715 469195 466231 463231 460754 459688 457217 459010 462250 462103 463466 465472 466867 466324
371505 467647 467405 464766 465789 465226 464309 464525 465396 465977 468964 474022 477149 477485 476844 477322 479774 478297 481806
351945 482433 487074 491888 495174 505063 513377 524067 540997 565820 599260 645292 713889 820195 971617
336622 1141285 1239336 1179962 1005869 821418 696627 623094 578743 554813 541564 532694 530588 529945
322300 539083 556335 587247 624517 644515 633760 597738 558392 530048 513831 499733 488904 484383
307895 489243 488000 487148 487727 487125 488073 486592 485815 483523 483190 482122 484362 485124 487506 488958 492877 496373 498342
$$ packed form
428154D55628j250l1L26q52J70J052R5J87J037N10j42O09J54j675J618N37r61D54906
408005D56597o52N75q09j344p20K649M81K489K078O08L547j08J705K658O916Q079D89838
388753D87424o061q648l520k964l000k477j066k471J793L240j47J363K006J395D66324
371505D67647k42k639J023n63r17K16Q71N81K987N058L127L36o41M78K452j477D81806
351945D82433M641M814L286R889Q314J0690J6930K4823L3440M6032O8597J06306I71617
336622A141285R8051n9374j74093j84451j24791p3533m4351k3930j3249q870k106E29945
322300E39083J7252L0912L7270J9998j0755l6022l9346k8344j6217j4098j0829D84383
307895D89243j243q52N79o02R48j481p77k292l33j068K240P62K382J452L919L496D98342
$$ plain form
287804 502929 502659 501803 499266 496913 494882 494697 496918 500330 501821 501213 502240 501282 500335 499536 498268 500246 497892
267542 497244 496735 495761 497899 500398 501660 500362 503587 504270 502359 506565 505269 507506 508862 509919 509879 510614
248249 511538 513461 518142 522096 528616 532707 533477 530463 522106 518041 515265 515500 517683 518941 515832 516457
229950 517580 516869 517400 521529 525321 532854 542171 557796 593743 667880 826341 1079512 1305602 1339036
213825 1134330 862962 677753 586558 550356 530200 519586 515023 511382 509712 507604 507088 512183 516339
197593 522918 527801 524340 516227 509701 505049 503481 504655 504418 506179 509104 514211 515191 512960 507648 502181
178910 498868 497340 494506 488853 486118 486696 494545 504593 515843 537215 551750 557554 544594 525714 508105
161267 494800 486729 481665 477967 474261 474314 474217 474887 477152 477129 476212 474405 474998 481221 491236 508732 521972 526923
$$ packed form
287804E02929k70q56k537k353k031j85K221L412J491o08J027r58r47p99j268J978D97892
267542D97244n09r74K138K499J262j298L225O83j911M206j296K237J356J057m0E10614
248249E11538J923M681L954O520M091P70l014q357m065k776K35K183J258l109E16457
229950E17580p11N31M129L792P533R317J5625L5947P4137J58461K53171K26090A339036
213825A134330k71368j85209r1195l6202k0156j0614m563l641j670k108n16N095E16339
197593E22918M883l461q113o526m652j568J174k37J761K925N107R80k231n312E02181
178910D98868j528k834n653k735N78P849J0048J1250K1372J4535N804j2960j8880E08105
161267D94800q071n064l698l706N3r7O70K265k3r17j807N93O223J0015J7496J3240E26923
$$ plain form
139929 521086 507229 492914 488384 489253 494710 498543 498787 506751 529266 584996 656043 702614 701686 649737
122008 578549 516886 479534 459855 448436 441508 436180 432558 430241 427545 426745 425314 427643 435419 464701
103957 511058 558433 580849 556922 516833 478419 455209 442637 436704 433927 428299 423607 416392 406736
86994 399360 393406 387944 387857 389604 391165 392080 393949 391970 389332 386218 383658 383450 382107 382432 384316 383599
$$ packed form
139929E21086j3857j4315m530Q69N457L833K44P964K2515N5730P1047M6571r28F49737
122008E78549o1663l7352j9679j1419o928n328l622k317k696q00j431K329P776D64701
103957E11058M7375K2416k3927m0089l8414k3210j2572n933k777n628m692p215D06736
86994C99360n954n462q7J747J561R15J869j979k638l114k560k08j343L25J884C83599
66244C82096  $$checkpoint
##END=