##TITLE= Raman spectrum of Beryl (no. 4022)
##MINERAL= Beryl
##CHEMISTRY= Be3Al2Si6O18
##JCAMP-DX= 5.01
##DATA TYPE= RAMAN SPECTRUM
##DATA CLASS= XYDATA
##ORIGIN= Department of Geology, UAIC, Romania
##OWNER= http://rdrs.uaic.ro � stud. Apopei Andrei Ionut
##LONGDATE= 2012/11/18 13:09:00.0508 +0200 $$ export date from JSpecView
##SPECTROGRAPHDATASYSTEM= HE 532 (Horiba Jobin-Yvon)
##XUNITS= Raman shift (1/cm)
##YUNITS= Intensity (cnt)
##XFACTOR= 3.188736E-3
##YFACTOR= 1.91007657E-3
##FIRSTX= 3399.97
##FIRSTY= 503.24931138
##LASTX= 211.234
##NPOINTS= 1024
##XYDATA= (X++(Y..Y))
1066244B63471M316k67j509J027Q91k960P9j802j253l641j73j734j022J388ml62B53706
$$ 263471 267787 267520 266011 267038 267929 264969 265048 263246 261993 258352 258179 256445 255423 256811 256807 256445 253706
1052288B54648j949q43J141m60K531l102Q33J310Q80k185K054j515o81r94J62o55B50185
$$ 254648 252699 251856 252997 252537 255068 251966 252799 254109 254989 252804 254858 253343 252662 251668 251830 251175 250185
1038223B48434r48j743J158J424l175l7p12k57j388P60l391K815O59M08q8j368B43484
$$ 248434 247486 245743 246901 248325 245150 245113 244401 244144 242756 243516 240125 242940 243599 244007 243919 242551 243484
1024048B41975P38J254j944L46N81j389k378m92K14J117J5o61j529j127k864N59B33405
$$ 241975 242713 243967 242023 242369 242950 241561 239183 238691 238905 240022 240037 239376 237847 236720 233856 234415 233405
1009767B35621j881j57j211j93m99K065k148J001j006j221K866k903K228o24P75B33655
$$ 235621 233740 233583 232372 232179 231680 233745 231597 232598 231592 230371 233237 230334 232562 231938 232713 233655
996172B33981k290l488L173k047K36J303k220j739j05J372j252j524q03K699j289B26038
$$ 233981 231691 228203 231376 229329 229565 230868 228648 226909 226804 228176 226924 225400 224597 227296 226007 226038
982480B24661n66N87r02j068K588J577j650K0l66j346J471k478O35k148J20j655B19914
$$ 224661 224095 224682 223780 222712 225300 226877 225227 225247 224881 223535 225006 222528 223163 221015 221135 219480 219914
967873B18573J47J6j897R80l2l185O70R81j086L26j68n35m18J78R48k803L149B15331
$$ 218573 218720 218736 216839 217819 217787 214602 215272 216253 215167 215493 215325 214790 214372 214550 215498 212695 215844 215331
952327B14267m09O3k159J813k0m00k189j656K483k168r96j372J100O44p12j173B05811
$$ 214267 213858 213921 211762 213575 213555 213155 210966 209310 211793 209625 208629 207257 208357 209001 208289 207116 205811
937481B07042j446N61o44j48j220j467K687l29q17L20r6P60k693P44O19j462J614B02286
$$ 207042 205596 206157 205513 205365 204145 202678 205365 205036 204219 204539 204443 205203 202510 203254 203873 202411 204025 202286
921685B01080K36k30j410k907j802R4K625r0j477k83L30j41k552Q13J581k24p50A97047
$$ 201080 201316 201086 199676 196769 194967 195061 197686 197596 196119 195836 196166 196025 193473 194286 195867 195643 194893 197047
905757A95569O13m82j776K94j05k772j101j010n19K814P49j211o55m29j388O92A88534
$$ 195569 196182 195700 193924 194218 194113 191341 190240 189230 188711 191525 192274 191063 190408 189979 188591 189283 188534
890544A86123J483j316K32J660Q69j251k25k091J960j645L09j138n08M40j340A85835
$$ 186123 187606 186290 186522 188182 189051 187800 187575 185484 187444 185799 186108 184970 184462 184902 183562 185835
876065A83938J32j426n86j043p86J656M86k498P50k233K243l99J106l961K641A79176
$$ 183938 184070 182644 182058 181015 180229 181885 182371 179873 180623 178390 180633 180234 181340 177379 180020 179176
861482A76641P07R37Q08j084N96j598J142R0j488k646j409J802k04O87k599j36A71994
$$ 176641 177348 178285 179093 178009 178605 177007 178149 178239 176751 174105 172696 174498 174294 174981 172382 172246 171994
845918A71417l87N18P12R65N13J88k487J230k183J430j95o02J016j666L67j179A68923
$$ 171417 171030 171548 172260 173225 173738 173926 171439 172669 170486 171916 171721 171119 172135 170469 170836 169657 168923
830232A70077j940Ok67R27j052J665j901Rj320l66m03j10J524j729l92Q89J90A65781
$$ 170077 168137 168143 167876 168803 167751 169416 167515 167524 166204 165838 165435 165325 166849 165120 164728 165617 165807 165781
813539A65010k25j147J435j482K56%O86k409q12k813K739O3l30m45l46K30j031A59022
$$ 165010 164785 163638 165073 163591 163847 163847 164533 162124 161312 158499 161238 161301 160971 160526 160180 160410 159379 159022
796704A58321R37J89j734m56J943p96K99j603J272k242J388n54k432J169P28r43A53563
$$ 158321 159258 159447 157713 157257 159200 158404 158703 157100 158372 156130 157518 156964 154532 155701 156429 155486 153563
780626A55775j494j388M39L41n54q71j042J94K095l159K227J011j05J284j012A52893
$$ 155775 154281 152893 153332 153673 153119 152248 151206 151400 153495 150336 152563 153574 153469 154753 153741 152893
765322A54135K45m1n76l606M68n77j194J200n56j986j173N82J366j93O97l259A47449
$$ 154135 154380 154339 153763 150157 150625 150048 148854 150054 149498 147512 146339 146921 148287 148094 148791 145532 147449
748993A48219j598q91L3J911J11R95k022l2m40Q54j393L61j304K62R4j405Q05A44315
$$ 148219 146621 145730 145763 147674 147785 148780 146758 146726 146286 147140 145747 146108 144804 145066 145160 143755 144560 144315
731613A44315%J64j42k63k61r38r00J283n96J356l567J303K42O12o49p28o18o61A40247
$$ 144315 144315 144479 144337 144074 143813 142875 141975 143258 142662 144018 140451 141754 141996 142608 141959 141231 140613 139952 140247
713160A40319p64j022n19P81m77M51p39m61j383m04K028j519k62l78K468k069A35850
$$ 140319 139555 138533 138014 138795 138318 138769 138030 137569 136186 135782 137810 136291 136029 135651 138119 136050 135850
696411A36207L1M30j603K62k185K378n97j446l56M19j875N08r07J032K21j095A31513
$$ 136207 136238 136668 135065 135327 133142 135520 134923 133477 133121 133540 131665 132173 131266 132298 132519 131424 131513
679523A31780J357J41p86J080K04j237M35nq01O2M09J336j519j315O55J5J242A32566
$$ 131780 133137 133278 132492 133572 133776 132539 132974 132969 132168 132230 132639 133975 132456 131141 131796 131811 133053 132566
661554A32021j069j042K51J47k47p49n55K698q70P39k609K321j294j210l88R59A28741
$$ 132021 130952 129910 130161 130308 130061 129312 128757 131455 130585 131324 128715 131036 129742 128532 128144 129103 128741
644387A29475j221M35j200m35k6o49P43j592N66K62o76l46j975J152j362O29Q28A24498
$$ 129475 128254 128689 127489 127054 127028 126379 127122 125530 126096 126358 125682 125336 123361 124513 123151 123780 124608 124498
626113A23508K237j352k751J520m2j032n92K36j551M24o3L51L04J31O45j89l7A20993
$$ 123508 125745 124393 121642 123162 123120 122088 121496 121732 120181 120605 120542 120893 121197 121328 121973 121784 121747 120993
607686A21868L56j477M82J655l51r74Q69j220o87l03J749k509J20P97m35P44p70A19096
$$ 121868 122224 120747 121229 122884 122533 121559 122428 121208 120521 120218 121967 119458 119578 120375 119940 120684 119914 119096
589099A19516J41n2M71R38j771N29J059p50j184L93j095N92j749j043J855o29A17048
$$ 119516 119657 119605 120076 121014 119243 119772 120831 120081 118897 119290 118195 118787 117038 115995 117850 117221 117048
571342A17100k074K62J142O91L2M71j226k30Q33O60n55J304j000m51K25J63k253A16477
$$ 117100 115026 115288 116430 117121 117153 117624 116398 116168 117001 117661 117106 118410 117410 116959 117184 117347 115094 116477
552438A15990p65J634j299k237N14J41n34O96j157R48j446J6l09J042n2J252j373A12878
$$ 115990 115225 116859 115560 113323 113837 113978 113444 114140 112983 113931 112485 112501 112192 113234 113182 114434 113061 112878
533374A14114k98l20m66P28m14NM14l30K25q38o65Q4J739j530J043j195J300n72A13375
$$ 114114 113816 113496 113030 113758 113344 113349 113763 113433 113658 112820 112155 112239 113978 112448 113491 112296 113596 113024 113375
513128A13030o3J132k164J697j168P91J68Q80k662Q86J83N19j179k300P76q23A09038
$$ 113030 112967 114099 111935 113632 112464 113255 113423 114303 111641 112527 112710 113229 112050 109750 110526 109703 109038
494748A09179q38M66p38R90J990J012L300l882q80k745J021k059P9l7q3R90K62A06717
$$ 109179 108341 108807 108069 109059 111049 112061 115361 111479 110599 107854 108875 106816 106895 106858 106775 107765 108027 106717
475182A07031J26O50k101P70p70K577j94r63N18j289J279j52R01O29l41N66j080A09483
$$ 107031 107157 107807 105706 106476 105706 108283 108089 107126 107644 106355 107634 107482 108383 109012 108671 109237 108157 109483
455444A08739k153K83M03K20j100J603p96o29j168J299j514J174O60k41q49N03A06439
$$ 108739 106586 106869 107272 107492 106392 107995 107199 106570 105402 106701 105187 106361 107021 106780 105931 106434 106439
436587A07173L66K31m45p65j090J194j068O18P3N82j478K1m14J226q06M19k049A04600
$$ 107173 107539 107770 107325 106560 105470 106664 105596 106214 106287 106869 105391 105412 104998 106224 105418 105837 103788 104600
416510A04716j16L36j085L83O96o55M67l98J488j169J205r43N92n66O34N92R17A07131
$$ 104716 104600 104936 103851 104234 104930 104275 104742 104344 105832 104663 105868 104925 105517 104951 105585 106177 107094 107131
396257A08917r85L757L415J1547R205L562n495q922n947l237k861j325k798p75A08587
$$ 108917 107932 111689 115104 126651 135856 139418 133923 125001 119054 115817 112956 111631 108833 108058 108587
379066A08708P28q12J477Q75N66J655l87l390J26N39j052J246k797Q33R06O55A13019
$$ 108708 109436 108624 110101 110976 111542 113197 112810 109420 109546 110085 109033 110279 107482 108315 109221 109876 113019
359572A15015M019K729J750n35M82K290O70M296K122L971Q063R640J3401J7352B09128
$$ 115015 119034 121763 123513 122978 123460 125750 126420 130716 132838 136809 144872 154512 167913 185265 209128
342104B47445M5663P2710J18495J82424K10689J11462p7368k10956k08739j41320B74535
$$ 247445 293108 365818 484313 666737 877426 988888 911520 700564 491825 350505 274535
328920B30392k7211j3197j0845k838R53J0687K2946M0382M5489K6814k2240m1843B16415
$$ 230392 203181 189984 179139 176301 177254 187941 210887 251269 296758 323572 301332 259489 216415
313446A87019k1652j2988o187m379q39j577j823o07j101nJ94m51M56J216m71o04A37941
$$ 187019 165367 152379 146192 141813 140974 139397 137574 136967 135866 135861 136055 135604 136060 137276 136805 136201 137941
293402A41445M648N286O003N988M449q75k788k756k148m71j791L652O81J414l93A63847
$$ 141445 146093 151379 157382 163370 167819 166944 164156 161400 159252 158781 156990 160642 161323 162737 162344 163847
274315A65004n33J330j100L237j890Q8J252k656j67J289k46K619m76J157N03J147A71198
$$ 165004 164471 165801 164701 167938 166048 166136 167388 164732 164565 165854 165608 168227 167751 168908 169411 170558 171198
253939A72319J105L359m67J299J896M208M316P446O422P759k924p276m767p696A84924
$$ 172319 173424 176783 176316 177615 179511 183719 188035 195481 201903 209662 206738 199462 194695 186999 184924
235683A83074J268j938J57q9l2P08L562K258O329N977J2301J6875L5797P1643E10947
$$ 183074 184342 182404 182561 182472 182440 183148 186710 188968 195297 201274 213575 230450 266247 337890 510947
217289G87431K60972N5385k22408l08456k11837j01886m0765j9174j0064p465A78789
$$ 787431 1048403 1103788 881380 572924 361087 259201 218436 199262 189198 181733 178789
203402A76034j436j902L882Q718P560L142l138r828p015m867o92P03J173L646A77909
$$ 176034 174598 172696 176578 185296 192856 195998 192860 183032 176017 171150 170458 171161 172334 175980 177909
184764A82288M045l579n375k054n108j539k002k577j022K792N480J2778K0694B28606
$$ 182288 186333 182754 177379 175325 170217 168678 166676 164099 163077 165869 171349 184127 204821 228606
167162B48099K023j5534k4461j8440j4009o030m547m061j204O65n2l57L076j881A63318
$$ 248099 250122 234588 210127 191687 177678 171648 167101 163040 161836 162501 162449 162092 165168 163287 163318
148249A65378K759P472J3941J7282J6844O344o271j5135j2767n323M086Q592M510B06350
$$ 165378 168137 175609 189550 206832 223676 230020 223749 208614 195847 190524 194610 203202 207712 206350
130386B12601K3874O2720P9784O3730K824n4065p3963o5669l7208j9457j0175A78626
$$ 212601 236475 299195 378979 442709 445533 391468 317505 251836 214628 195171 184996 178626
114803A75583o61J660j382J640P38L945J1563L5441N6548N7938K5052k0782m2435B58609
$$ 175583 174922 176582 175200 176840 177578 181523 193086 228527 285075 343013 368065 347283 304848 258609
96702B35343r132m338O13l755m480p592o867k458m469k058J189J697O643K520B02604
$$ 235343 226211 221873 222486 218731 214251 206659 199792 197334 192865 190807 191996 193693 200336 202856 202604
77250B00766k6n82j609J027Q71M007O44B04460
$$ 200766 200740 200158 198549 199576 200447 204454 205098 204460
66244B08535  $$checkpoint
##END=