##TITLE= Raman spectrum of Beryl (no. 5720)
##MINERAL= Beryl
##CHEMISTRY= Be3Al2Si6O18
##JCAMP-DX= 5.01
##DATA TYPE= RAMAN SPECTRUM
##DATA CLASS= XYDATA
##ORIGIN= Department of Geology, UAIC, Romania
##OWNER= http://rdrs.uaic.ro � stud. Apopei Andrei Ionut
##LONGDATE= 2012/11/20 10:08:25.0747 +0200 $$ export date from JSpecView
##SPECTROGRAPHDATASYSTEM= HE 532 (Horiba Jobin-Yvon)
##XUNITS= Raman shift (1/cm)
##YUNITS= Intensity (cnt)
##XFACTOR= 3.188736E-3
##YFACTOR= 5.01652095E-3
##FIRSTX= 3399.97
##FIRSTY= 1562.49847977
##LASTX= 211.234
##NPOINTS= 1024
##XYDATA= (X++(Y..Y))
1066244 311471 318652 317284 317527 319067 319801 319889 320341 319015 319680 317174 318521 319158 318574 318271 318764 319148 318534 318676
1051508 318638 316218 316391 319002 318599 317882 316848 314861 316291 316549 317130 316466 316237 316158 315284 314947 316989 317011 318814
1036652 317963 317521 320085 319881 320493 320928 319725 319142 320741 319670 319187 321459 320894 320537 320184 320169 318159 319177 319482
1021678 319680 318898 319107 319471 317803 318031 316592 320605 320206 322746 322906 322742 322594 321454 323733 324247 323740 323226
1007374 323347 322655 323919 323356 324440 324200 323215 321971 321359 321129 321067 323169 321912 324357 322599 323184 322401 322112
992961 323161 324096 324603 324487 325537 325249 326174 327509 326175 328077 328561 327748 327072 327947 328168 326783 327428 327769 327416
977622 326615 326030 326529 325994 324404 325203 325564 326905 325531 324693 325472 324635 327203 328145 328584 328081 329045 331618 330798
962159 329804 330312 330602 330945 331372 331369 332108 331347 327955 328565 329148 328129 329067 329310 330218 329641 328712 328515 328715 328981
945742 328811 329610 330801 331141 332288 332639 332364 332211 332916 330994 332151 332968 332458 331749 332385 331432 330362 329999 330186
930014 330158 328963 327929 328391 328195 329067 328761 327724 328477 329762 330965 331466 331573 331284 331824 331537 331900 331253 332723
914155 330853 332464 331761 332187 330801 329993 332053 330391 331173 330850 330046 330539 330524 329579 329112 328660 328524 327936 328871
898165 331007 331115 332677 332639 332913 334561 336628 335310 335779 335218 335252 335174 335915 336171 334921 334352 334035 331790 331403
882042 332409 333701 332401 331297 331349 330701 332853 333827 332955 332957 333769 332929 335548 335276 335234 334884 334879 335087 335928 336180 336270
864063 335898 334913 333861 332959 332067 332259 333429 334359 331403 332252 330482 332558 331703 331090 332187 333151 333796 337349
848521 335827 336419 335689 336652 336720 336367 338278 337646 335855 336631 336198 335885 335868 337469 333702 335119 335728 335348 335485
831982 335689 333638 334207 335824 335913 335692 336038 337545 338703 340422 340135 339514 340960 339874 340821 339536 340161 337782
816182 337033 337247 336926 335960 337375 336952 337566 337451 336522 335244 336777 337239 337858 336897 337771 339892 340629 339838 339527
799373 342576 341462 341275 341989 341754 338963 339351 338109 338299 337391 337268 337464 336800 335550 336944 335984 333898 335129
783314 335359 337639 338469 338467 338618 340344 339367 339315 339992 340275 340612 339526 339988 339266 339307 338077 338639 338054 338231 337928
765322 337581 339526 338091 338030 338090 340070 338714 338915 340563 341962 340827 341391 341544 344382 344247 344835 343202 344267
748993 343615 343612 343712 343316 343936 342616 344292 344514 344798 344535 344453 343139 343111 345749 344665 344500 347315 348125 348103 351561
730694 352349 353356 352459 350216 348564 349996 348649 347603 347576 348550 346712 345592 346681 345730 346703 344594 344258
715011 345189 343852 344735 344320 344447 346158 346508 347362 347555 347578 347756 345411 346697 347485 348326 347219 346258 347732 345189
697342 344459 342291 343461 343871 342972 342522 341187 343083 345121 342077 343996 343698 346160 346626 346524 349200 348404
681408 348339 347500 347516 348033 346996 346928 346464 346488 346795 345993 346271 347291 347095 347853 349738 348190 348493 348498 349247 351675 353787
661554 353600 352006 352287 352628 350728 351451 352777 351472 352448 350821 349997 351010 350232 349040 348757 347783 347889 348116
644387 348240 348723 349132 348851 348937 349976 349051 349046 348722 347989 349814 350727 349086 347835 347845 346851 345931 345881 344244 341007
625147 343325 343529 342239 342453 342589 342707 343511 344122 343705 342889 345373 344347 347521 349130 347275 346660 347616 346555
607686 346006 346192 344876 346210 347114 346819 345408 343984 344042 344174 345425 344571 344918 347612 347105 348365 348122 348240
590080 350240 349798 348338 347800 348514 347772 346219 345993 345588 345633 345254 344514 342816 341299 341040 340101 340586 341172 342200
571342 338675 339145 338164 340523 341174 341287 342570 341292 340099 340629 340218 340305 339960 337696 335516 336046 335189 333349 334122
552438 333950 333288 333342 335234 334466 335500 337372 335641 333728 334550 334827 333362 333845 333861 335587 335695 335432 334506 333271
533374 332330 333753 332959 332825 332675 333864 332373 332628 334603 334216 333599 334826 335290 335759 336322 335962 335341 333294 332469
514144 332769 332134 331327 330804 329736 328839 328586 325818 326763 325448 325436 324570 324253 326809 325638 324796 324924 324484 323654
494748 322122 322143 320711 320130 319725 318911 318576 319380 318681 317404 315377 315017 316056 317250 316375 316312 316628 318124 317923
475182 316574 317552 317288 316913 317417 316710 318255 319801 319393 317385 315634 314928 315406 316761 316205 315341 314743 316077 315492
455444 316085 316334 316688 316468 316023 316976 317835 314566 314245 314657 312336 310318 310458 309592 309618 308164 305669 306814 307032
435533 308523 307131 308560 307913 306164 304866 304223 306257 305553 305002 303920 303072 301756 301181 301083 301262 301009 299989
416510 299309 298333 297988 298085 300419 299421 299628 298347 300654 302265 301516 301066 302043 301341 301156 300192 302891 301972 300040
396257 300581 302159 301440 301933 305059 309550 313226 315066 310561 308635 307944 306318 304203 303120 300722 300272 299886
377987 300584 299197 300210 301396 301396 299327 298641 295567 295181 295708 296054 296146 294541 296641 298223 301939 307456 311336
358484 315892 318320 318694 319333 318879 317882 318226 321041 323738 326025 334096 345754 357409 376566 403545 441595
341010 494663 578648 703754 886895 1099267 1230046 1175403 969187 741589 578669 482832 429093
327820 393156 373438 359756 352055 350179 354363 364030 386000 415678 434952 429558 402339 370697 346950
312337 330487 320218 310104 307265 306219 303544 300938 300811 299578 297588 296963 297284 295907 297417 298029 300189
294520 300028 302996 305958 311657 317505 322112 324060 322626 319826 315877 311689 309623 307628 307932 307438 308420
276568 308080 309077 308372 308736 308289 310918 311139 310262 310939 311189 310253 310599 310476 310750 310075 310132 310544 310924 311349 310359
253939 309680 311682 312924 313788 313527 313100 315978 320855 323993 329349 333814 333244 331806 324616 320630 318626 316001
234537 314975 315187 313967 314244 314051 315122 316380 317899 323407 331639 340947 356706 387151 453170 601520 847380
216134 1087582 1144751 946855 677770 483634 391509 349882 330098 320354 314015 311274 309138 307391
201079 309184 311414 315845 323461 330479 329356 320659 312015 306746 305187 302497 303313 302343 301806 301086 300163 299526
181253 295448 292404 290267 289511 287835 286803 284876 286746 292524 299644 310800 327808 342409 347174 336741
163627 318688 304213 293573 287098 282978 279737 279372 277659 277375 277735 278063 278691 278432 277216 277053 279554 288294
143498 300210 309594 314826 311325 299615 287907 283135 283416 286067 290970 292195 300006 322552 371423 434524
125602 487339 493841 448340 383411 329709 296787 277864 269027 261994 257618 254617 254910 253481 253396 253286
107578 257149 267461 300586 356010 409880 431931 407064 361406 315409 287937 273225 268756 264362
91853 261396 255631 250495 245839 242492 240224 238698 237850 239706 242846 244464 243649 241339 239583 237361 234716
72365 233143 231835 230046 230810 230286
66244B30529  $$checkpoint
##END=