##TITLE= Raman spectrum of Black Carbon (Isaiia) � http://rdrs.uaic.ro
##MINERAL= Black Carbon
##CHEMISTRY= C
##JCAMP-DX= 5.01
##DATA TYPE= RAMAN SPECTRUM
##DATA CLASS= XYDATA
##ORIGIN= Department of Geology, UAIC, Romania
##OWNER= http://rdrs.uaic.ro � stud. Apopei Andrei Ionut
##LONGDATE= 2011/04/17 23:02:04.0719 +0300 $$ export date from JSpecView
##XUNITS= Raman shift (1/cm)
##YUNITS= Intensity (cnt)
##XFACTOR= 3.188736E-3
##YFACTOR= 2.87331949E-4
##FIRSTX= 3399.97
##FIRSTY= -14.69943712
##LASTX= 211.234
##NPOINTS= 1024
##XYDATA= (X++(Y..Y))
$$ plain form
1066244 -51158 94 1562 -6352 5007 22383 21852 34830 33844 36881 49203 17550 6962 5493 -676
1054622 -4146 2938 14936 7910 12334 3545 2082 19652 35549 17844 24450 13678 17469 32455 44598
1042924 36124 32811 48853 53022 42822 35175 24146 14160 6762 8558 17195 31413 29221 34541 57210
1031152 44604 47046 44181 46430 60086 55065 43314 49324 47077 64852 87356 91468 82619 86869 83153
1019300 55649 41233 42384 65690 82785 92875 84700 84182 72240 87638 86097 100261 112093 90899
1008171 97190 84649 102668 109126 104095 105736 131977 116140 107930 106920 112302 123440 160188 159517 155052
996172 148312 155792 160276 142148 125714 129457 151468 148078 151184 133940 132820 125062 147377 138578 144240
984095 158856 161381 157641 157726 141056 150096 171979 163917 181730 190097 183894 179850 170987 169734 190706 185423
$$ packed form
1066244e1158N1252J468p914J1359J7376n31J2978r86L037J2322l1653j0588j469f76
1054622d146P084J1998p026M424q789j463J7570J5897j7705O606j0772L791J4986D4598
1042924C6124l313J6042M169j0200p647j1029r986p398J796Q637J4218k192N320E7210
1031152D4604K442k865K249J3656n021j1751O010k247J7775K2504M112q849M250H3153
1019300E5649j4416J151K3306J7095J0090q175n18j1942J5398j541J4164J1832I0899
1008171I7190j2541J8019O458n031J641K6241j5837q210j010N382J1138L6748o71A55052
996172A48312P480M484j8128j6434L743K2011l390L106j7244j120p758K2315q799A44240
984095A58856K525l740Q5j6670R040K1883q062J7813Q367o203m044q863j253K0972A85423
$$ plain form
971128 177238 177178 166407 171350 167924 178567 205491 218157 219491 219746 217066 220296 217151 207530 201204 205798
958069 194644 208991 216231 233917 224869 230722 228992 210396 213790 207801 197496 212415 229357 242752
946566 256137 265811 279838 283330 264724 267742 259765 250172 255358 244723 260266 244949 228581 229133
934997 245658 241219 253738 278816 280634 293822 298927 272697 259198 273195 293092 308351 287503 297871
923353 296733 292039 303131 292604 293966 296197 302491 304607 298985 303543 305476 305097 311899 304359 332857 323041
909962 328528 307289 309668 316594 315617 310580 309897 303160 307876 303391 313677 317856 317269 318887 315237 332150
896474 345414 340011 324747 322721 321629 333341 336429 344740 336991 310401 334464 349008 348451 345662 327117
883745 333807 340770 337656 340780 333515 339861 346353 365194 370645 357036 349600 344335 351700 330869 349806
$$ packed form
971128A77238o0j0771M943l426J0643K6924J2666J334K55k680L230l145r621o326B05798
958069A94644J4347P240J7686r048N853j730j8596L394n989j0305J4919J6942B42752
946566B56137R674J4027L492j8606L018p977r593N186j0635J5543j5317j6368B29133
934997B45658m439J2519K5078J818J3188N105k6230j3499J3997J9897J5259k0848B97871
923353B96733m694J1092j0527J362K231O294K116n622M558J933l79O802p540K8498C23041
909962C28528k1239K379O926r77n037o83o737M716m485J0286M179n87J618l650C32150
896474C45414n403j5264k026j092J1712L088Q311p749k6590K4063J4544n57k789C27117
883745C33807O963l114L124p265O346O492J8841N451j3609p436n265P365k0831C49806
$$ plain form
870931 366805 346149 339524 354495 334518 344816 323030 328702 341581 327196 328499 328282 331315 348571
858895 353370 367873 352250 319359 328312 335045 329174 323368 315149 338823 337786 344522 355631 356114 347185
845918 323367 324044 323586 319297 346127 344318 352544 340859 343983 322952 345870 337362 330720 326577 332219
832854 333410 338415 328420 334030 322044 332118 326508 333648 335996 324599 324177 336516 327864 319259 328344
819704 327268 318345 297780 299624 305528 323609 332544 330786 319564 319738 308042 305155 305322 293151 317037
806467 334796 344790 331342 332823 320236 320109 314831 315711 315293 309433 316956 316000 309155 313588 308042 284974
792251 275397 265529 263407 241010 241981 249768 265265 273520 286258 300551 286079 293275 285939 283717 279126
778832 270000 296179 306070 308371 301112 262365 261283 288481 301459 281721 305309 296604 306457 302051
$$ packed form
870931C66805k0656o625J4971j9977J0298k1786N672J2879j4385J303k17L033C48571
858895C53370J4503j5623l2891Q953O733n871n806q219K3674j037O736J1109M83C47185
845918C23367O77m58m289K6830j809Q226j1685L124k1031K2918q508o642m143C32219
832854C33410N005r995N610j1986J0074n610P140K348j1397m22J2339q652q605C28344
819704C27268q923k0565J844N904J8081Q935j758j1222J74j1696k887J67j2171C17037
806467C34796R994j3448J481j2587j27n278Q80m18n860P523r56o845M433n546B84974
792251B75397r868k122k2397R71P787J5497Q255J2738J4293j4472P196p336k222B79126
778832B70000K6179R891K301p259l8747j082K7198J2978j9738K3588q705R853C02051
$$ plain form
766225 300435 301353 305969 310209 298362 298333 292102 287650 287950 316827 321933 308482 299669 318798 332934 349213
751724 329198 337866 322070 324951 313272 326653 328889 332084 317536 353185 349412 355977 341588 333949
738948 328480 341578 346462 344353 385000 382151 378907 357886 365072 367429 347982 342960 354768 380461 376602
725171 375508 368295 348478 354602 349248 348907 343453 344231 358379 357784 364271 362004 359977 362678 362821 351933
710376 346068 352157 350618 338572 323289 334192 345580 333145 332599 330198 340008 349114 339179 343970 337091
696411 340977 338289 341063 343617 314095 307286 320781 327015 333442 342011 330084 330878 344004 335288 330214
682349 322297 338390 333985 340009 338479 358572 349772 361397 353065 350351 336642 335079 350166 346640 361956
668193 366546 349165 346959 351707 367557 375113 387820 379627 379440 356139 350795 352758 371561 368376 361003
$$ packed form
766225C00435R18M616M240j1847k9o231m452L00K8877N106j3451q813J9129J4136C49213
751724C29198Q668j5796K881j1679J3381K236L195j4548L5649l773O565j4389C33949
738948C28480J3098M884k109M0647k849l244k1021P186K357j9447n022J1808K5693C76602
725171C75508p213j9817O124n354l41n454P78J4148n95O487k267k027K701J43C51933
710376C46068O089j539j2046j5283J0903J1388j2435n46k401R810R106r935M791C37091
696411C40977k688K774K554k9522o809J3495O234O427Q569j1927P94J3126q716C30214
682349C22297J6093m405O024j530K0093q800J1625q332k714j3709j563J5087l526C61956
668193C66546j7381k206M748J5850P556J2707q193j87k3301n344J963J8803l185C61003
$$ plain form
653943 363025 370654 369404 377564 369657 369853 356698 337104 333369 345725 370658 350188 361412 367250 354822
639592 339332 325344 344428 355044 356114 341468 337150 320066 333916 327121 325075 340162 339289 328328
626113 329890 347430 347932 349459 342454 330428 323233 315343 322628 319622 325071 332285 334131 337661 341127 350164
610606 352993 365772 357875 349939 340953 352831 350359 341542 352525 359678 361939 368123 357453 363439 378489
595963 389433 389128 396133 387406 371766 370258 375482 385746 402022 410860 393964 397792 379278 376541 374089
581224 387424 400943 392512 380955 370101 369117 371566 384807 389579 386121 385928 387924 381760 378900 361114
566384 356070 359843 369553 362636 360211 368551 366127 366413 373018 372544 366300 355019 353644 350019 343442 339297
550441 358998 369884 360839 359891 355459 357018 358239 365645 357795 369528 393391 400975 407121 427786 425795
$$ packed form
653943C63025P629j250Q160p907J96j3155j9594l735J2356K4933k0470J1224N838C54822
639592C39332j3988J9084J0616J070j4646m318j7084J3850o795k046J5087q73C28328
626113C29890J7540N02J527p005j2026p195p890P285l006N449P214J846L530L466C50164
610606C52993J2779p897p936q986J1878k472q817J0983P153K261O184j0670N986C78489
595963C89433l05P005q727j5640j508N224J0264J6276Q838j6896L828j8514k737C74089
581224C87424J3519q431j1557j0854r84K449J3241M772l458j93J996o164k860C61114
566384C56070L773R710o917k425Q340k424K86O605m74o244j1281j375l625o577C39297
550441C58998J0886r045r48m432J559J221P406p850J1733K3863P584O146K0665D25795
$$ plain form
535391 429137 444307 459230 464843 465958 462912 454314 475078 471888 471434 487362 501709 523620 535810 545558
520234 547423 552014 559130 590029 618010 648114 649317 665896 708050 741541 771548 821342 860827 898769
505997 920210 919042 924674 948018 946759 948842 932389 923760 908158 900181 897102 878941 854185 842246 813605
490643 783329 777026 756410 745555 729571 710245 695542 695207 680250 673652 659593 658175 651434 637560
476214 633455 652006 650592 654401 641721 627359 632973 637335 634307 610545 619759 640879 640080 636013 633568
460653 643196 660095 666874 636489 650448 658141 665901 666500 665343 679461 688779 699387 698142 714177 715129
444985 711125 715575 717178 723742 750536 740565 751631 763338 753716 772166 775333 783240 780829 781174 788616
429208 765190 761896 755191 762253 757956 748008 755868 759789 749047 752748 756917 746362 717935 706541 683667
$$ packed form
535391D29137J5170J4923N613J115l046q598K0764l190m54J5928J4347K1911J2190E45558
520234E47423M591P116L0899K7981L0104J203J6579M2154L3491L0007M9794L9485H98769
505997I20210j168N632K3344j259K083j6453q629j5602p977l079j8161k4756j1939H13605
490643G83329o303k0616j0855j5984j9326j4703l35j4957o598j4059j418o741F37560
476214F33455J8551j414L809j2680j4362N614M362l028k3762R214K1120p99m067F33568
460653F43196J6899O779l0385J3959P693P760N99j157J4118R318J0608j245J6035G15129
444985G11125M450J603O564K6794r971J1066J1707r622J8450L167P907k411L45G88616
429208G65190l294o705P062m297r948P860L921j0742L701M169j0555k8427j1394F83667
$$ plain form
413324 703400 702040 694161 694918 685056 671939 663579 654763 648938 650577 649667 646030 626445 621686 622270 622597
396257 619607 600512 596261 583183 584771 571733 569872 566386 550534 526644 515752 509057 515865 529688
381220 507751 479705 477854 476509 471422 469823 461318 437529 432749 430888 430026 414655 414809 397376 408570
365004 406623 411279 394509 384909 368532 368749 369469 365243 362571 359371 361594 361213 372339 367971 373985 372062
347577 370954 360032 351289 349653 347981 345397 336593 340421 336166 330401 327656 322507 324108 318357 312416 319471
330024 314501 308096 310554 295580 293166 299935 301940 297653 286645 285580 280290 272961 271333 264957 256936
313446 266305 251253 248237 256565 260303 248621 249470 253165 250184 249326 250088 246122 245552 249261 252268 246861
295637 237111 236901 253777 263421 262126 252966 242573 247901 244270 253233 248441 255384 243744 267637 266354
$$ packed form
413324G03400j360p879P57r862j3117q360q816n825J639r10l637j9585m759N84F22597
396257F19607j9095m251j3078J588j3038j861l486j5852k3890j0892o695O808E29688
381220E07751k8046j851j345n087j599q505k3789m780j861q62j5371J54j7433D08570
365004D06623M656j6770r600j6377K17P20m226k672l200K223l81J1126m368O014C72062
347577C70954j0922q743j636j672k584q804L828m255n765k745n149J601n751n941C19471
330024C14501o405K458j4974k414O769K005m287j1008j065n290p329j628o376B56936
313446B66305j5052l016Q328L738j1682Q49L695k981q58P62l966n70L709L007B46861
295637B37111k10J6876R644j295r160j0393N328l631Q963m792O943j1640K3893B66354
$$ plain form
278819 259701 250937 249151 247249 249271 247782 244730 245721 241711 248979 255178 253942 237397 248208 253991 259500
260750 258370 257122 265652 266354 269446 261250 251455 247158 252028 255864 256693 258227 260337 267306 262925 255857
242545 264227 263581 261052 264570 266780 251039 249748 254715 255192 258066 261116 260435 262078 261500 253788 249617 248410
223052 254915 252330 254410 271025 266174 255452 252616 250155 259240 267547 256584 252774 255139 260395 272852
205722 271735 271278 279969 276305 283278 289072 282373 278447 279380 275473 273271 272971 271648 266960 261697 258593 263247
185933 262478 260018 263513 269735 265367 266835 252051 241550 253942 252093 245171 240125 240832 234059 236543
168339 235580 235659 239374 229084 232040 235062 233328 232966 223387 219478 225057 230134 225981 228874 228778 225517 242205
148249 229179 218796 217387 231857 226125 231524 227979 225826 222000 224138 212339 207455 205609 204733 203879
$$ packed form
278819B59701q764j786j902K022j489l052R91m010P268O199j236j6545J0811N783B59500
260750B58370j248Q530P02L092q196r795m297M870L836Q29J534K110O969m381B55857
242545B64227o46k529L518K210j5741j291M967M77K874L050o81J643n78p712m171B48410
223052B54915k585K080J6615m851j0722k836k461R085Q307j0963l810K365N256B72852
205722B71735m57Q691l664O973N794o699l926R33l907k202l00j323m688n263l104B63247
185933B62478k460L495O222m368J468j4784j0501J2392j849o922n046P07o773B36543
168339B35580P9L715j0290K956L022j734l62r579l909N579N077m153K893r6l261B42205
148249B29179j0383j409J4470n732N399l545k153l826K138j1799m884j846q76B03879
$$ plain form
130386 208420 200248 198408 182639 184843 183216 176277 175895 178031 168160 160922 164818 153723 146799 145851 146091
111193 141688 135080 127395 138607 128143 131171 119165 115610 113026 104798 99016 96965 91870 88094 83513
93066 85547 80089 67391 69692 60938 59621 59493 63967 58784 51379 46591 33299 31714 28860 22157 24663
73587 18794 17709 7069 78 -665 -1196
$$ packed form
130386B08420q172j840j5769K204j627o939l82K136r871p238L896j1095o924r48A46091
111193A41688o608p685J1212j0464L028j2006l555k584q228n782k051n095l776H3513
93066H5547n458j2698K301q754j317j28M474n183p405m788j3292j585k854o703B4663
73587A8794j085j0640o991p43a196
66244f199  $$checkpoint
##END=