##TITLE= Raman spectrum of Brochantite � http://rdrs.uaic.ro
##MINERAL= Brochantite
##CHEMISTRY= Cu4(SO4)(OH)6
##JCAMP-DX= 5.01
##DATA TYPE= RAMAN SPECTRUM
##DATA CLASS= XYDATA
##ORIGIN= Department of Geology, UAIC, Romania
##OWNER= http://rdrs.uaic.ro � stud. Apopei Andrei Ionut
##LONGDATE= 2010/06/01 16:27:43.0387 +0300 $$ export date from JSpecView
##SPECTROGRAPHDATASYSTEM= HE 532 (Horiba Jobin-Yvon)
##XUNITS= Raman shift (1/cm)
##YUNITS= Intensity (cnt)
##XFACTOR= 3.188909E-3
##YFACTOR= 6.09359096E-4
##FIRSTX= 3399.61
##FIRSTY= 47.33109376
##LASTX= 210.701
##NPOINTS= 1024
##XYDATA= (X++(Y..Y))
$$ plain form
1066073 77674 73118 61290 52688 45035 46881 50334 45135 44991 47439 42167 37133 38075 32797 26290 24611
1053674 19065 12992 11166 6077 4873 1906 5847 1084 -1 1268 4267 1825 3763 2417 5538 5704
1041190 6134 7978 9220 10234 6827 8435 11600 12917 13600 11385 10858 11866 12779 15730 15914 16737 20069 20175
1027041 20394 26824 27893 32052 35176 43197 43680 42940 35494 33580 31211 28201 28448 21254 20065 21530 18260
1013575 20437 18196 13223 11332 11648 12637 13106 15136 12475 13620 14759 12084 13576 17604 14149 12092 11684
1000013 14063 14435 12406 12146 15309 13553 13983 11771 11691 9636 13107 6788 8206 9325 8153 9190 7727
986350 10226 10357 14054 10414 11347 10374 8971 6767 5612 6600 8243 9272 10867 8761 8284 8922 7215 7752
971774 8309 8098 3167 7354 12339 13065 10723 10001 11873 12079 6395 7749 8238 8353 6585 5637 9287 7823
$$ packed form
1066073G7674m556j1828q602p653J846L453n199j44K448n272n034R42n278o507B4611
1053674A9065o073j826n089j204k967L941m763j085J269K999k442J938j346L121E704
1041190F134J844J242J014l407J608L165J317O83k215n27J008R13K951J84Q23L332B0175
1027041B0394O430J069M159L124Q021M83p40p446j914k369l010K47p194j189J465A8260
1013575B0437k241m973j891L16R89M69K030k661J145J139k675J492M028l455k057A1684
1000013A4063L72k029k60L163j756M30k212q0k055L471o319J418J119j172J037G727
986350A0226J31L697l640R33r73j403k204j155R88J643J029J595k106m77O38j707G752
971774H309k11m931M187M985P26k342p22J872K06n684J354M89J15j768r48L650G823
$$ plain form
957083 8461 6054 5586 6342 7953 7943 7450 8053 8885 10472 11293 12081 3935 3979 7219 3737 4 5960 10514
941451 8281 4921 3729 7091 7760 6777 5860 3662 5712 8245 8830 5649 8336 6339 2645 5729 6821
927352 8384 7671 8404 6116 7912 4246 9547 7033 6785 2696 6293 6694 5082 6448 6797 8330 1664 6450
912312 6672 7596 8521 4061 5513 3168 3747 3036 3114 4890 8232 9726 10422 8239 5566 4382 3287 4131
897153 7002 8057 7767 7204 2799 6684 5610 6662 9872 10838 9354 10028 8645 8587 5751 7602 7548 3928
881872 6680 7693 5686 9340 7773 10718 9066 5982 10354 10031 8298 7266 4943 7626 9028 8943 8433
867331 9839 11083 7018 5013 4838 7335 8060 9333 9294 11391 4742 8714 8231 6119 4325 5247 12761 13883
851818 10430 12200 13698 8311 8169 8444 10111 8144 10919 8845 6411 4307 5389 6309 8554 6771 9150
$$ packed form
957083H461k407m68P56J611j0m93O03Q32J587Q21P88q146M4L240l482l733N956A0514
941451H281l360j192L362O69r83r17k198K050K533N85l181K687j997l694L084F821
927352H384p13P33k288J796l666N301k514k48m089L597M01j612J366L49J533o666F450
912312F672R24R25m460J452k345N79p11P8J776L342J494O96k183k673j184j095D131
897153G002J055k90n63m405L885j074J052L210R66j484O74j383n8k836J851n4C928
881872F680J013k007L654j567K945j652l084M372l23j733j032k323K683J402q5H433
867331I839J244m065k005j75K497P25J273l9K097o649L972m83k112j794R22P514A3883
851818A0430J770J498n387j42K75J667j967K775k074k434k104J082R20K245j783I150
$$ plain form
837051 4315 5842 5728 7060 8667 4363 12409 8753 7462 7716 3658 5677 2901 9476 11651 7532 6665
822175 6259 4890 9248 9020 8540 3398 4387 5629 9138 8324 6907 4748 6377 8192 8389 5082 2390 7066
806301 5403 10201 6230 3475 9304 6156 6425 4920 8463 5044 4745 8837 7072 7772 5997 5646 -90
791192 3380 8187 7565 5015 4788 6159 2702 1764 322 3348 90 2919 241 1736 1423 4922 8015
775968 3883 8159 2440 5556 3220 4005 3564 1119 4696 5744 4548 8804 4345 12641 10438 8005 16696
760630 13289 8973 7000 9494 9284 12117 8415 10460 11027 10368 11888 8273 9322 14125 15250 17656 14369
745176 12845 11966 12051 11052 14442 15687 18431 18767 19519 19307 18109 18181 16064 19278 15157 19333 20105 17866 17817
727766 17504 18144 22275 21415 17061 17120 23265 22578 22055 17646 14681 16128 19918 19164 21059 17337 18137 17425
$$ packed form
837051D315J527j14J332J607m304Q046l656j291K54m058K019k776O575K175m119F665
822175F259j369M358k28m80n142R89J242L509q14j417k159J629J815J97l307k692G066
806301E403M798l971k755N829l148K69j505L543l419k99M092j765P00j775l51i0
791192C380M807o22k550k27J371l457r38j442L026l258K829k678J495l13L499H015
775968C883M276n719L116k336P85m41k445L577J048j196M256m459Q296k203k433A6696
760630A3289m316j973K494k10K833l702K045N67o59J520l615J049M803J125K406A4369
745176A2845q79Q5r99L390J245K744L36P52k12j198P2k117L214m121M176P72k239A7817
727766A7504O40M131q60m354N9O145o87n23m409k965J447L790p54J895l722Q00A7425
$$ plain form
711137 15816 17928 18387 20204 21560 20408 19541 18466 16646 15209 18982 19537 21788 22407 19403 16223 16579
695307 15982 16490 16626 18458 14828 16287 14429 16523 14336 17491 16081 17834 17178 21076 16490 13972 14322
679358 16117 19357 15951 13071 13759 18683 16754 14387 18950 16407 14214 18611 21706 17990 20044 17937
664233 17199 19219 19050 22865 18349 21277 17669 16513 19867 16740 10504 13004 21000 18529 18029 19609 14510
648046 19582 14691 17770 15266 12192 14209 14419 13634 11818 12062 12721 14070 17071 15738 11109 8988 6822
631733 9200 7112 8428 10466 13129 8249 10212 13751 13535 11534 9972 6549 4801 5483 10501 11622 13827
615295 15058 12808 11444 6928 10788 10706 11128 14781 12653 9573 9066 13825 13549 12124 12100 12285 12974 13411
597756 14189 13324 13293 13568 8698 13102 15524 16689 11755 14267 14755 16797 15348 15486 11466 12252 15119 14592
$$ packed form
711137A5816K112M59J817J356j152q67j075j820j437L773N55K251O19l004l180A6579
695307A5982N08J36J832l630J459j858K094k187L155j410J753o56L898m586k518A4322
679358A6117L240l406k880O88M924j929k367M563k543k193M397L095l716K054A7937
664233A7199K020j69L815m516K928l608j156L354l127o236K500P996k471n00J580A4510
648046A9582m891L079k504l074K017K10p85j816K44O59J349L001j333m629k121F822
631733I200k088J316K038K663m880J963L539k16k001j562l423j748O82N018J121A3827
615295A5058k250j364m516L860q2M22L653k128l080n07M759k76j425k4J85O89A3411
597756A4189q65l1K75m870M404K422J165m934K512M88K042j449J38m020P86K867A4592
$$ plain form
580070 18555 15819 16324 9582 10078 10979 11980 14186 15396 11768 9981 8763 12944 7612 7120 8621 4452
563233 7915 10974 7224 11883 9679 10114 5887 4550 3763 -2 6657 5938 7596 3803 8835 10814 5700
546268 6006 10441 4028 6801 7189 5574 11318 12311 10098 14324 11359 11262 8486 5655 9406 12862 10014
529172 10036 9522 11079 13283 12380 16164 13030 11090 8715 15646 14346 15413 18386 15711 23033 23043 18118
511943 18985 24288 17681 22396 25021 25973 30473 28308 32844 33715 31817 29866 30807 26790 28610 25111 23639
494580 27292 25615 24016 22496 18853 14665 17364 20208 18028 16506 14143 13665 9061 10250 10281 10696 11966
477079 15198 11994 15492 6632 8184 9322 8929 8746 11936 9041 12607 8740 8204 8610 11033 14004 11240
459442 14500 12494 14881 10963 12411 12547 14874 11553 13708 18524 16883 15068 13911 14037 13716 13231 16766
$$ packed form
580070A8555k736N05o742M96R01J001K206J210l628j787j218M181n332m92J501D452
563233G915L059l750M659k204M35m227j337p87l765O659p19J658l793N032J979E700
546268F006M435o413K773L88j615N744R93k213M226k965r7k776k831L751L456A0014
529172A0036n14J557K204r03L784l134j940k375O931j300J067K973k675P322J0A8118
511943A8985N303o607M715K625R52M500k165M536Q71j898j951R41m017J820l499B3639
494580B7292j677j599j520l643m188K699K844k180j522k363m78m604J189L1M15A1966
477079A5198l204L498q860J552J138l93j83L190k895L566l867n36M06K423K971A1240
459442A4500k006K387l918J448J36K327l321K155M816j641j815j157J26l21m85A6766
$$ plain form
441671 13832 14129 13135 10895 14130 13163 16751 17745 12643 12885 15154 15672 15085 11084 13335 13169 12291 11962
422699 11218 13508 12613 13559 15632 14576 11354 13847 13363 10887 13733 12540 15213 10442 13685 11258 10573
404637 12188 12281 11642 12360 12543 11293 12593 12340 16313 13707 12525 13412 10424 14563 14225 12738 14415 14078
385358 11048 14040 12225 12184 10381 8600 9194 8081 5664 6828 4192 5454 7088 84 1815 2890 -97
367003 1656 1788 6047 1460 5707 5498 6186 5670 10801 21341 44819 58313 61241 51700 44893 42805 40398
348502 38494 46508 66070 94774 123333 128134 114992 79196 63412 72106 90455 91275 82755 56027 36885
332054 25503 19069 18610 20109 17172 15471 17217 14659 15372 13982 17089 22986 21009 24034 31491 36143 51577
313278 72471 108658 157038 219035 295175 403247 596240 850088 999864 876500 546998 273614
$$ packed form
441671A3832K97r94k240L235r67L588R94n102K42K269N18n87m001K251j66q78A1962
422699A1218K290q95R46K073j056l222K493m84k476K846j193K673m771L243k427A0573
404637A2188R3o39P18J83j250J300k53L973k606j182Q87k988M139l38j487J677A4078
385358A1048K992j815m1j803j781N94j113k417J164k636J262J634p004J731J075i7
367003A656J32M259m587M247k09O88n16N131J0540K3478J3494K928r541o807k088D0398
348502C8494Q014J9562K8704K8559M801j3142l5796j5784Q694J8349Q20q520k6728C6885
332054B5503o434m59J499k937j701J746k558P13j390L107N897j977L025P457M652E1577
313278G2471L6187M8380O1997P6140J08072J92993K53848J49776j23364l29502B73614
$$ plain form
299933 147288 95295 66378 54307 41708 38171 36471 38611 41515 42599 41742 47758 60472 69767 77013
283147 71676 61487 55346 45009 40768 35199 32080 35986 43634 47622 46025 39279 34052 32337 29185 24421
265111 20442 21091 20830 14752 14890 13547 10253 11073 10270 7001 9816 9597 11258 13573 14879 9745 12382 12148
244659 14025 19085 16698 20003 14623 14256 14708 14621 7494 13830 14263 17892 25417 34199 36914 35895 27617
225184 20990 13037 9616 4355 5081 1427 3433 2910 3546 110 7511 3648 2292 2676 3597 7760 9459
205552 10766 14657 18614 23110 32347 42625 52917 80530 122574 160525 185966 201447 208676 197625
189267 167879 144059 129734 113826 82408 46287 20692 6313 5502 3449 1281 -136 291 506 1494
171699 1800 10214 10271 19259 32141 45711 66635 87338 107734 135518 156273 172660 171540 158149 157578
$$ packed form
299933A47288n1993k8917j2071j2599l537j700K140K904J084q57O016J2714R295G7013
283147G1676j0189o141j0337m241n569l119L906P648L988j597o746n227j715l152B4421
265111B0442O49k61o078J38j343l294Q20q03l269K815k19J661K315J306n134K637A2148
244659A4025N060k387L305n380l67M52q7p127O336M33L629P525Q782K715j019B7617
225184B0990p953l421n261P26l654K006n23O36l436P401l863j356L84R21M163I459
205552A0766L891L957M496R237J0278J0292K7613M2044L7951K5441J5481P229A97625
189267A67879k3820j4325j5908l1418l6121k5595j4379q11k053k168j417M27K15A494
171699A800Q414N7Q988J2882J3570K0924K0703K0396K7784K0755J6387j120j3391A57578
$$ plain form
154005 178915 212887 252510 267765 246502 214928 177425 147654 138580 138882 148604 150461 140303 120475
137377 108240 111374 135798 158086 172610 154848 125995 104313 101112 106617 143346 198371 274672 351261
120638 384413 355464 275919 195812 134027 93434 75643 62514 53556 43250 36755 28411 20803 15650
103788 20649 40661 75022 100804 105684 85326 53580 21361 8148 80 2108 2519 12073 15458 14622
85608 22354 20514 20838 23570 21418 23997 37426 63865 79590 79883 60816 37060 19585 7254 4220
67299 -41 4888
$$ packed form
154005A78915L3972L9623J5255k1263l1574l7503k9771r074L02R722J857j0158A20475
137377A08240L134K4424K2288J4524j7762k8853k1682l201N505L6729N5025P6301C51261
120638C84413k8949p9545q0107o1785m0593j7791j3129q958j0306o495q344p608A5650
103788B0649K0012L4361K5782M880k0358l1746l2219j3213q068K028M11R554L385A4622
85608B2354j840L24K732k152K579J3429K6439J5725K93j9067k3756j7475j2331D220
67299d1D888
##END=