##TITLE= Raman spectrum of Bronzite � http://rdrs.uaic.ro
##MINERAL= Bronzite
##CHEMISTRY= (Mg,Fe++)2Si2O6
##JCAMP-DX= 5.01
##DATA TYPE= RAMAN SPECTRUM
##DATA CLASS= XYDATA
##ORIGIN= Department of Geology, UAIC, Romania
##OWNER= http://rdrs.uaic.ro � stud. Apopei Andrei Ionut
##LONGDATE= 2010/09/11 16:05:36.0543 +0300 $$ export date from JSpecView
##SPECTROGRAPHDATASYSTEM= HE 532 (Horiba Jobin-Yvon)
##XUNITS= Raman shift (1/cm)
##YUNITS= Intensity (cnt)
##XFACTOR= 3.188909E-3
##YFACTOR= 4.08713777E-4
##FIRSTX= 3399.61
##FIRSTY= 11.10459476
##LASTX= 210.701
##NPOINTS= 1024
##XYDATA= (X++(Y..Y))
1066073 27170 20491 20800 21109 21419 21729 22039 22349 22659 22969 23280 23590 23901 24212 24130 24130 25374 27087 26301 26301 26301
1049782 26301 26301 26301 26301 26301 26301 26301 26301 26301 26301 26301 26301 26301 26301 26301 26301 26301 26301 26301 26301 26301 26301 26301 26301 26301 26301 26301 26301 26301 26301 26301 26301 26301 26301 26301 26301 26301 26301 26301 26301 26301 26301 26301 26301 26301 26301 26301 26301 26301 26301 26301 26301 26301 26301 26301 26301 26301
1004811 26301 26301 26301 26301 26301 26301 26301 26301 26301 26301 26301 26301 26301 26301 26301 26301 26301 26301 26301 26301 26301 26301 26301 26301 26301 26301 26301 26301 26301 26301 26301 26301 26301 26301 26301 26301 26301 26301 26301 26301 26301 26301 26301 26301 26301 26301 26301 26301 26301 26301 26301 26301 26301 26301 26301 26301 26301
958720 26301 26301 26301 26301 26301 26301 26301 26301 26301 26301 26301 26301 26301 26301 26301 26301 26301 26301 26301 26301 26301 26301 26301 26301 26301 26301 26301 26301 26301 26301 26301 26301 26301 26301 26301 26301 26301 26301 26301 26301 26301 26301 26301 26301 26301 26301 26301 26301 26301 26301 26301 26301 26301 26301 26301 26301 26301
911472 26301 26301 26301 26301 26301 26301 26301 26301 26301 26301 26301 26301 26301 26301 26301 26301 26301 26301 26301 26301 26301 26301 26301 26301 26301 26301 26301 26301 26301 26301 26301 26301 26301 26301 26301 26301 26301 26301 26301 26301 26301 26301 26301 26301 26301 26301 26301 26301 26301 26301 26301 26301 26301 26301 26301 26301 26301
863035 26301 26301 26301 26301 26301 26301 26301 26301 26301 26301 26301 26301 26301 26301 26301 26301 26301 26301 26301 26301 26301 26301 26301 26301 26301 26301 26301 26301 26301 26301 26301 26301 26301 26301 26301 26301 26301 26301 26301 26301 26301 26301 26301 26301 26301 26301 26301 26301 26301 26301 26301 26301 26301 26301 26301 26301 26301
813372 26301 26301 26301 26301 26301 26301 26301 26301 26301 26301 26301 26301 26301 26301 26301 26301 26301 26301 26301 26301 26301 26301 26301 26301 26301 26301 26301 26301 26301 26301 26301 26301 26301 26301 26301 26301 26301 26301 26301 26301 26301 26301 26301 26301 26301 26301 26301 26301 26301 26301 26301 26301 26301 26301 26301 26301 26301
762443 26301 26301 26301 26301 26301 26301 26301 26301 26301 26301 26301 26301 26301 26301 26301 26301 26301 26301 26301 26301 26301 26301 26301 26301 26301 26301 26301 26301 26301 26301 26301 26301 26301 26301 26301 26301 26301 26301 26301 26301 26301 26301 26301 26301 26301 26301 26301 26301 26301 26301 26301 26301 26301 26301 26301 26301 26301
710208 26301 26301 26301 26301 26301 26301 26301 26301 26301 26301 26301 26301 26301 26301 26301 26301 26301 26301 26301 26301 26301 26301 26301 26301 26301 26301 26301 26301 26301 26301 26301 26301 26301 26301 26301 26301 26301 26301 26301 26301 26301 26301 26301 26301 26301 26301 26301 26301 26301 26301 26301 26301 26301 26301 26301 26301 26301
656632 26301 26301 26301 26301 26301 26301 26301 26301 26301 26301 26301 26301 26301 26301 26301 26301 26301 26301 26301 26301 26301 26301 26301 26301 26301 26301 26301 26301 26301 26301 26301 26301 26301 26301 26301 26301 26301 26301 26301 26301 26301 26301 26301 26301 26301 26301 26301 26301 26301 26301 26301 26301 26301 26301 26301 26301 26301
601667 26301 26301 26301 26301 26301 26301 26301 26301 26301 26301 26301 26301 26301 26301 26301 26301 26301 26301 26301 26301 26301 26301 26301 26301 26301 26301 26301 26301 26301 26301 26301 26301 26301 26301 26301 26301 26301 26301 26301 26301 26301 26301 26301 26301 26301 26301 26301 26301 26301 26301 26301 26301 26301 26301 26301 26301 26301
545268 26301 26301 26301 26301 26301 26301 26301 26301 26301 26301 26301 26301 26301 26301 26301 26301 26301 26301 26301 26301 26301 26301 26301 26301 26301 26301 26301 26301 26301 26301 26301 26301 26301 26301 26301 26301 26301 26301 26301 26301 26301 26301 26301 26301 26301 26301 26301 26301 26301 26301 26301 26301 26301 26301 26301 26301 26301
487389 26301 26301 26301 26301 26301 26301 26301 26301 26301 26301 26301 26301 26301 26301 26301 26301 26301 26301 26301 26301 26301 26301 26301 26301 26301 26301 26301 26301 26301 26301 26301 26301 26301 26301 26301 26301 26301 26301 26301 26301 26301 26301 26301 26301 26301 26301 26301 26301 26301 26301 26301 26301 26301 26301 26301 26301 26301
427986 26301 26301 26301 26301 26301 26301 26301 26301 26301 26301 26301 26301 26301 26301 26301 26301 26301 26301 26301 26301 26301 26301 26301 26301 26301 26301 26301 26301 26437 26561 26685 26810 26934 27058 27182 27307 27431 27555 27680
386433 27804 27929 28054 28178 28303 28428 28553 28678 28803 28928 29053 29178 29304 29429 29554 29680 29805 29931 30056 30182 30308
363748 30433 30559 30685 30644 30950 36326 36326 36326 36326 36326 36326 36326 36326 43655 41747 47409 56613 67378 81468 82634 73333 74366
339743 74366 71086 69496 74273 84755 98364 117543 149303 192395 235598 288610 366643 472744 622314
324343 803652 948459 1007813 984718 907629 830190 783122 727543 620583 477817 343969 244329
311058 175841 132993 111752 95218 78051 71828 72501 73391 78396 80805 79925 87551 96615 99772 110454 132176
293233 158422 187916 205358 191598 154091 114666 91731 92471 97977 87944 76250 78967 86701 93224
277525 96088 87856 81309 89352 97712 103632 118191 131388 132803 123930 107002 95661 93042 80701 62362
260581 55007 56133 61741 65248 59308 59121 68869 68470 59728 55179 50917 48441 53414 61035 64510 60897 55131
241234 53173 56045 70691 93521 104895 105125 103168 93678 83919 85513 90773 91212 81879 66201 62704 72041
222882 83559 108519 149123 193136 262302 392993 567295 707549 751230 708478 635447 593344 607499
207870 623972 579612 485833 371408 260303 197082 175257 149861 130688 131283 128895 121460 114681 106932
191600 106028 105528 102321 106699 105628 101147 114044 120499 106190 100374 99614 87421 78650 79202 89305 114601
172874 141402 154678 148567 125592 110310 109338 102359 96272 98565 87859 65292 47754 33023 25806
156371 32747 38106 34664 37313 47935 50393 44505 43415 41723 33570 32547 37467 36558 39393 50966 59579
137377 60812 59139 74177 124952 193073 258559 327917 391862 436625 469175 477535 438346 362682 283849
120638 229962 205155 186460 163252 148412 149674 177176 249403 373591 550149 756889 911901 925485
104995 797012 604905 424033 292760 216719 173070 140898 120677 111002 103802 98322 91920 79492
89255 62081 42141 27498 24742 23825 18148 14430 14270 22909 52642 105104 174653 240239 262895 232436
70971 174600 108920 51035 18610
66073G813  $$checkpoint
##END=