##TITLE= Raman spectrum of Calcite � http://rdrs.uaic.ro
##MINERAL= Calcite
##CHEMISTRY= CaCO3
##JCAMP-DX= 5.01
##DATA TYPE= RAMAN SPECTRUM
##DATA CLASS= XYDATA
##ORIGIN= Department of Geology, UAIC, Romania
##OWNER= http://rdrs.uaic.ro � stud. Apopei Andrei Ionut
##LONGDATE= 2009/10/13 19:10:19.0258 +0300 $$ export date from JSpecView
##SPECTROGRAPHDATASYSTEM= HE 532 (Horiba Jobin-Yvon)
##XUNITS= Raman shift (1/cm)
##YUNITS= Intensity (cnt)
##XFACTOR= 3.188736E-3
##YFACTOR= 2.16838119E-3
##FIRSTX= 3399.97
##FIRSTY= 19.01067222
##LASTX= 211.234
##NPOINTS= 1024
##XYDATA= (X++(Y..Y))
1066244H767K1188L294n052J800M453j1275p468J34N144K186n355J933P83j279B0788
1053844B7093N787o676R036q643N70K784M73l027m358m763n96j291p352R571N590A9499
1040575B8668O238o536P149m651n996n668n99M762K648l49M034m131M127l583K45C5160
1027210B5809M56r557m659j431J2342l432l397p789O218k511M858O317m80J0055C3663
1014540C1312p148j1382l014P424Q803N262p818j714j468K47N855j845q906j141B1388
1001783A8550L925l6o296J4475j673o54L448p754q437N323k334J1299J119o740B5047
988937B4479K650o399k91N062q332K311m854L469R04o262q833J51O754P059J2184C7265
975189C5894K722q182l413o444j761M049k932j382m747n548P594O374l636n80A5130
$$ y = [8767, 29955, 33249, 28197, 29997, 34450, 23175, 15707, 15841, 20985, 23171, 17816, 19749, 20532, 19253, 20788, 27093, 32880, 26204, 35240, 26597, 27167, 29951, 30424, 27397, 23039, 18276, 17680, 16389, 9037, 18608, 24198, 19499, 28668, 34906, 28370, 35519, 30868, 24872, 19204, 18605, 23367, 26015, 25666, 29700, 25569, 29696, 26113, 26358, 35160, 25809, 26265, 16708, 12049, 10618, 22960, 19528, 16131, 8342, 14560, 12049, 16907, 23224, 22744, 32799, 33663, 31312, 24164, 12782, 9768, 17192, 25995, 31257, 23439, 21725, 20257, 20504, 26359, 24514, 15608, 14467, 21388, 18550, 22475, 22439, 16143, 30618, 28945, 28291, 31739, 23985, 15548, 20871, 18537, 29836, 30955, 24215, 25047, 24479, 27129, 20730, 20439, 25501, 17169, 19480, 14626, 18095, 18999, 12737, 3904, 4055, 10809, 17868, 30052, 37265, 35894, 38616, 30434, 27021, 20577, 18816, 22865, 19933, 18551, 13804, 8256, 15850, 22224, 18588, 18008, 15130]
962159B1985K120M050N134l091R472O118j1362n602j0527o408r569Q395M114K613C3114
949037C5471M826k947o512r202o180l055J251n203P201L105J80k001j0916P776A0606
935825A728J2308R592P846q255q177K726P095j2033k271N584J038J1982j0397A9193
923353A9343J10j139k210q069M354J10J990j090J0179R254m420J5214j6564o854B3953
909962B1173j5020P875J8817L419j848m367p001o837K638n217k151m552k644K675B3787
896474B5725q334O239P54K233l636p027k787n227J116m179Q314l779L714K869I785
882892I629R418L853R952J78o97l371K282j2326k7L77R22k903o58M815J0476o604B1968
867500E281J0479J2279O675l776p070p356o676M357N07M491K441k239r444J5608C1076
$$ y = [21985, 24105, 28155, 33289, 30198, 39670, 45788, 34426, 28824, 18297, 11889, 2320, 10715, 14829, 17442, 33114, 35471, 40297, 37350, 30838, 21636, 15456, 12401, 13652, 8449, 15650, 18755, 18935, 16934, 6018, 13794, 10606, 1728, 14036, 23628, 31474, 23219, 15042, 17768, 24863, 12830, 10559, 16143, 17181, 29163, 18766, 19193, 19343, 19453, 18314, 16104, 8035, 12389, 12499, 14489, 13399, 23578, 32832, 28412, 43626, 27062, 20208, 23953, 21173, 6153, 14028, 32845, 36264, 34416, 30049, 23048, 16211, 18849, 13632, 11481, 6929, 4285, 6960, 23787, 25725, 17391, 23630, 24384, 26617, 22981, 15954, 13167, 7940, 9056, 4877, 13191, 9412, 13126, 15995, 9785, 9629, 19047, 22900, 32852, 33030, 32333, 28962, 31244, 18918, 18891, 19268, 20190, 17287, 16629, 21444, 31920, 25316, 21968, 5281, 15760, 28039, 34714, 30938, 23868, 16512, 9836, 14193, 14700, 19191, 21632, 19393, 9949, 25557, 31076]
853714A8886k952N837p612r862O840M915J1529q75l614n214k085k604l869P810A7376
839831A2883L891k774K436q312M481l08R151M331n937j0836K542k162P411M153A9263
825851A6791j2331J5748o45J8884l040q713l839l709M170j3438q14m833M940J6104A3799
811773A3127j092O917j476p11J574R999n589j335P466q733j1470m685K495Q894A2217
797595A7683r543j017N642m282n537O351Q000R571j02r575J740r917K212n569B0153
783314I322O918J1981M953j6720N738m262n81j782n025K058m451K893q365j311E950
768932I648P665n384K630r4k409K166m469k853N730L2M276j189o98q507l423N917A1185
752634A2509O716N083R188L628k409j259j8903j3658R478N084j172o514j304P319E935
$$ y = [18886, 15934, 21771, 14159, 4297, 11137, 16052, 27581, 26706, 23092, 17878, 15793, 13189, 9320, 17130, 17376, 12883, 16774, 14000, 16436, 8124, 12605, 12297, 21448, 25779, 19842, 9006, 11548, 9386, 16797, 20950, 19263, 16791, 4460, 20208, 19563, 38447, 35407, 26694, 22855, 19146, 23316, 9878, 9064, 4231, 9171, 25275, 13799, 13127, 12035, 18952, 17476, 16765, 18339, 28338, 22749, 21414, 28880, 20147, 8677, 3992, 6487, 15381, 12217, 17683, 8140, 7123, 12765, 8483, 2946, 9297, 17297, 26868, 26766, 17191, 18931, 9014, 11226, 5657, 20153, 9322, 16240, 28221, 33174, 16454, 22192, 17930, 17349, 15567, 10542, 12600, 8149, 11042, 2677, 1366, 5950, 9648, 17313, 11929, 14559, 14465, 12056, 14222, 9753, 6900, 12630, 12662, 16938, 15749, 15051, 6544, 3121, 9038, 11185, 12509, 19225, 24308, 33496, 37124, 34715, 33456, 14553, 895, 10373, 15457, 14285, 7771, 6467, 13786, 5935]
738032F734l006k421J877J2001J249n423l364K772K612m841J299N249J155o858A5551
723330D506L120J667k601j207L415m274M027O74Q564J428R3M436j1575n833j84A1392
707591A5125L432N454r300m434l579r84R925J707L604o873R013p003p904k089A3345
692669A7532o596J3442p194J556j642q656J399k025j757n75K324M745l115Q520A0500
677638A4481j0997o47j467O241Q538N799j635J782n597K103o444j523r45J1604B1951
662504B4326O770j3991m195k273L02R659l163l676M993O950k455K490j939l27B5350
647256A5532m099J1392L450p884J957q74L225L455n535L555J977j3096p790J2500A8372
631902B2740j1340o48L573l301m502J096R730r15o640j630k726L219p222Q708D527
$$ y = [6734, 3728, 1307, 3184, 15185, 16434, 11011, 7647, 10419, 13031, 8190, 9489, 14738, 15893, 9035, 15551, 4506, 7626, 9293, 6692, 5485, 8900, 4626, 8653, 9327, 17891, 19319, 19412, 23848, 12273, 6440, 6256, 11392, 15125, 18557, 24011, 14711, 10277, 6698, 5714, 15639, 17346, 20950, 14077, 23090, 16087, 8183, 6094, 13345, 17532, 10936, 24378, 17184, 18740, 17098, 8442, 9841, 7816, 6059, 5484, 7808, 12553, 9438, 17958, 10500, 14481, 3484, 2837, 1370, 7611, 16149, 21948, 20313, 22095, 16498, 18601, 12157, 10634, 9689, 21293, 21951, 24326, 31096, 17105, 12910, 10637, 10939, 20598, 17435, 13759, 18752, 25702, 23247, 25737, 23798, 23471, 25350, 15532, 11433, 22825, 26275, 18391, 20348, 19474, 22699, 26154, 20619, 24174, 26151, 13055, 5265, 17765, 18372, 22740, 11400, 10752, 14325, 11024, 6522, 7618, 17348, 16433, 9793, 8163, 5437, 8656, 1434, 10142, 4527]
616435E373L497k037J780N365L673J49q25l347p331k988K564R858j373j873o162E948
599880A0787l538J477R438m340j995p476k962K553R99J3248n842j2349R686O248A1991
584181H643p530N470K248J2887k931q931K459P786k865N153l212M092m134j813B2365
568366A7966J83j2418P025p692j777P464J087k032L528j801J679m492M94n344H672
552438I898L701J4358P880m23m933o601j5172M955o540M760p53O872n008K866A2465
536397A4231r957L748p819M633M401J460n53P83O30K76K675l021j107k686l688F563
519221I796L15J844m831N196J18J286o866J534j14K917L759J171k405j264j086A5769
501914A2652J12m516M170J932k379J59k6k967l148J188j998J041k688M252R673A2976
$$ y = [5373, 8870, 6833, 8613, 13978, 17651, 17800, 16975, 13628, 6297, 3309, 5873, 15731, 14358, 12485, 6323, 5948, 10787, 7249, 8726, 18164, 13824, 11829, 4353, 1391, 3944, 4943, 18191, 12349, 0, 9686, 15934, 11991, 8643, 1113, 6583, 8831, 21718, 18787, 9856, 12315, 20101, 17236, 22389, 19177, 23269, 19135, 17322, 22365, 17966, 18149, 5731, 12756, 5064, 3287, 10751, 11838, 9806, 13334, 11533, 13212, 8720, 9214, 3870, 8672, 9898, 13599, 27957, 35837, 35414, 30481, 23880, 8708, 13663, 7123, 11883, 11130, 18002, 12994, 15860, 12465, 14231, 4274, 8022, 203, 4836, 9237, 10697, 10144, 10927, 11557, 11833, 14508, 11487, 10380, 7694, 4006, 6563, 9796, 10111, 11955, 7124, 12320, 12438, 13724, 6858, 8392, 8278, 11195, 14954, 16125, 13720, 12456, 11370, 15769, 12652, 12764, 8248, 12418, 14350, 11971, 12130, 12104, 9137, 5989, 7177, 5179, 6220, 3532, 7784, 17457, 12976]
484471E674O517n457N37k560J95M217K380J56m802N37J35o30k094O741k946K040A0701
465852A7139k86l543l567J574k949l253n30M63K538L097q66R379P691P887L17B4253
448127A3204Q7o2K29o653k007J681j809K446N266o300L291M280l96K624l983p132A0143
429208G226l62J181P55j516j766k269K677l377N86J825K769J515N4k542o60l975C761
410134A619R43J923P489o09K69n310j335L152k437N53n26K101k438l24k71J128D735
390898D228J815j084K164l456K497J501j400J246L141o003J944P9J097J86L827F702
372587C055L809m846K952L160J942j68j801k629j659j187O22k74K61k208L108E841
354128C576K231L801L80m97l591M584M66M692M0318K67553M61736K13707k74495B41325
$$ y = [5674, 12191, 6734, 7271, 4711, 4906, 9123, 11503, 11659, 6857, 7394, 7529, 6899, 4805, 11546, 8600, 10640, 10701, 17139, 16853, 13310, 9743, 11317, 8368, 5115, 4585, 5048, 7586, 10683, 9817, 19196, 26887, 34774, 35091, 24253, 13204, 13291, 13229, 13458, 6805, 4798, 6479, 4670, 7116, 12382, 6082, 9373, 13653, 13257, 15881, 11898, 4766, 10143, 7226, 6864, 8045, 8800, 7284, 5518, 3249, 5926, 2549, 3135, 4960, 7729, 9244, 9298, 6756, 6096, 2121, 3761, 1619, 2562, 4485, 11974, 11365, 11634, 6324, 4989, 8141, 5704, 6257, 5731, 7832, 5394, 5070, 4799, 5927, 4735, 4228, 6043, 4959, 7123, 3667, 6164, 7665, 6265, 7511, 10652, 4649, 6593, 6672, 7769, 7955, 11782, 6702, 3055, 6864, 2018, 4970, 8130, 10072, 9904, 8103, 5474, 3815, 2628, 3250, 2976, 3237, 1029, 4137, 5841, 3576, 5807, 9608, 9988, 9491, 5900, 10484, 10950, 15642, 55960, 323513, 785249, 998956, 724461, 241325]
337720D9648k4727n267n027o620k245k033J413K046j114L46j040J095j133j63G978
320092E438j102K677j320L086l334q06J600j716j535L028j562q22k85P81J012E469
301217D798j249n55J402L158N59m039p43r67K277j356k240J400K41K438l07j17B521
281069E340k983J268n22l26L639j495J28Q62O08j361k045j666J509r49R31M92B982
260750A756M14L005j994ll318K12n1K355j700O99O98k97K09q35n54J155l3J953C304
237973A968L65j180m03Q46K43J163r11K480Q910K6967L4988K2995j5895l6976A7868
219595F464k188k59j287m47k045J879N25q39L67o43k27J418o00p65J530J036r38C064
197593D021k90N89j390J106K02M67n03R74N13n00j040j409J107j543K582j957C023
$$ y = [49648, 24921, 19654, 14627, 8007, 5762, 3729, 5142, 7188, 6074, 6420, 5380, 6475, 5342, 5179, 7978, 5438, 4336, 7013, 5693, 8779, 5445, 4639, 6239, 4523, 2988, 6016, 4454, 3632, 3347, 4128, 5140, 5469, 4798, 3549, 2994, 4396, 7554, 8113, 4074, 3331, 2364, 4641, 3285, 1045, 2445, 2686, 5124, 4817, 4700, 2521, 5340, 2357, 3625, 3103, 2777, 6416, 4921, 5049, 5911, 6519, 5158, 3113, 1447, 2956, 2007, 2938, 3430, 2982, 1756, 2170, 5175, 3181, 3178, -140, 72, 21, 2376, 676, 1375, 2073, 1776, 1985, 1150, 596, 1751, 1718, 3671, 3304, 1968, 2333, 1153, 750, 1596, 1839, 3002, 2091, 4571, 13481, 40448, 75436, 98431, 82536, 45560, 17868, 6464, 4276, 4017, 2730, 2283, 238, 2117, 2642, 1803, 2170, 1527, 1300, 2718, 2118, 1353, 2883, 3919, 2981, 3064, 4021, 3731, 4320, 2930, 4036, 4238, 4705, 4202, 5176, 5689, 5189, 4149, 2740, 3847, 2304, 4886, 2929, 3023]
176565B278J09o60J256n08R2p53r82K3J00J244J20J321j79j63m43k57m27J884C902
152990D960J553j695j11P04l579J425Q35j03p29qq88K2M43Q29o57m76r46R65p75C134
127995B431l79L11p18j8p7m27J153r66p11Q44O45J070K67k747J38P94J193q51B116
103957C691J55K80J245K501K795M466J0210J7160M3037O6485P3649M3632q400B09436
85779A45472n6259l6177k1718j0303p439m589j819l113n69k723Q07k397O47P8a044
$$ y = [2278, 2387, 1727, 2983, 2475, 2567, 1814, 832, 855, 955, 2199, 2319, 3640, 3461, 3298, 2855, 2598, 2171, 4055, 3902, 4960, 6513, 4818, 4707, 5411, 1832, 3257, 4092, 3989, 3260, 3252, 2364, 2386, 2829, 3658, 3001, 2525, 1579, 2544, 1769, 3134, 2431, 2052, 2363, 1645, 1627, 1550, 1123, 2276, 1310, 599, 1443, 2088, 3158, 3425, 678, 816, 1610, 2803, 1952, 2116, 3691, 3846, 4126, 5371, 7872, 10667, 15133, 25343, 42503, 85540, 152025, 225674, 269306, 260906, 209436, 145472, 89213, 53036, 31318, 21015, 13576, 8987, 7168, 4055, 3486, 763, 1570, -827, -180, -102, -1044]
66244e55  $$checkpoint
##END=