##TITLE= Raman spectrum of Calcite � http://rdrs.uaic.ro
##MINERAL= Calcite
##CHEMISTRY= CaCO3
##JCAMP-DX= 5.01
##DATA TYPE= RAMAN SPECTRUM
##DATA CLASS= XYDATA
##ORIGIN= Department of Geology, UAIC, Romania
##OWNER= http://rdrs.uaic.ro � stud. Apopei Andrei Ionut
##LONGDATE= 2011/10/14 11:53:56.0306 +0300 $$ export date from JSpecView
##SPECTROGRAPHDATASYSTEM= HE 532 (Horiba Jobin-Yvon)
##XUNITS= Raman shift (1/cm)
##YUNITS= Intensity (cnt)
##XFACTOR= 3.188909E-3
##YFACTOR= 9.75295797E-3
##FIRSTX= 3399.61
##FIRSTY= 4267.34352257
##LASTX= 210.701
##NPOINTS= 1024
##XYDATA= (X++(Y..Y))
$$ plain form
1066073 437544 446790 445611 444490 446656 449084 448758 449511 449689 449489 448820 449140 449038 448641 450258 450495 450047 447809
1052118 450092 449804 448217 449073 449284 448737 448083 447497 449196 450017 450719 450140 450348 450276 450796 450799 452466 453563 454355 451474
1036486 452717 455924 457167 457105 456078 456233 457642 457314 458519 457802 456257 459856 461115 460088 458823 457743 457842
1023090 457554 456633 456102 458255 458007 456631 456964 458229 458698 461243 462262 463577 464490 464762 464564 463401 462563 464279
1008800 465135 467082 466968 466917 466239 465154 463879 464706 466071 465260 465231 465359 466690 468176 468440 468048 466413 466650 468787
993597 468182 470572 470246 471850 471489 471140 473573 475251 475029 474010 474061 475470 475173 474693 476806 476931 477390 474472
979075 474603 475696 475630 476459 476387 475360 474952 474709 476131 477638 478311 477516 477694 478689 479415 481448 481635 481861 483995
963624 484740 483937 484753 483595 483803 484508 485511 485935 485689 484748 484003 481891 482267 482251 482843 485273 484369 483838 484654
$$ packed form
1066073D37544R246j179j121K166K428l26P53J78k00o69L20j02l97J617K37m48D47809
1052118D50092k88j587Q56K11n47o54n86J699Q21P02n79K08p2N20LJ667J097P92D51474
1036486D52717L207J243o2j027J55J409l28J205p17j545L599J259j027j265j080D57842
1023090D57554r21n31K153k48j376L33J265M69K545J019J315R13K72j98j163q38D64279
1008800D65135J947j14n1o78j085j275Q27J365q11k9J28J331J486K64l92j635K37D68787
993597D68182K390l26J604l61l49K433J678k22j019N1J409k97m80K113J25M59D74472
979075D74603J093o6Q29p2j027m08k43J422J507O73p95J78R95P26K033J87K26D83995
963624D84740q03Q16j158K08P05J003M24k46r41p45k112L76j6N92K430r04n31D84654
$$ plain form
948048 484956 485420 485388 485732 485228 486079 487437 488189 486989 486428 488941 490342 488306 487458 488586 486930 487783 488421
933169 487493 486407 486914 485441 485860 485897 485356 485881 484030 484998 484067 486132 484849 486284 487074 487914 487074 489267 490705
917339 489248 487383 488189 488322 488832 489656 490715 488981 487912 487469 486989 486892 487023 487290 487319 486482 486940 485695 486404
901374 485073 484849 484222 485911 488090 489520 490651 489971 491102 491716 490336 491724 491281 491588 491291 490977 491484 490547
886131 489013 490099 490729 488837 488346 487709 488944 489632 489651 488418 487466 488034 488024 489352 490667 488960 489838 490443 490817
869906 489731 490027 490843 490166 491465 491812 490683 489784 488400 488344 487503 488213 488013 486991 489072 487583 485679 485204
854411 486634 487157 486284 486679 487743 487685 489488 488706 490264 489678 490480 489560 487957 486983 487495 488312 488714 487679 487839
837923 488309 487605 486746 485895 487370 486242 487162 485452 486396 484761 486300 486690 487962 488669 490142 491932 491948 491966
$$ packed form
948048D84956M64l2L44n04Q51J358P52j200n61K513J401k036q48J128j656Q53D88421
933169D87493j086N07j473M19L7n41N25j851R68r31K065j283J435P90Q40q40K193D90705
917339D89248j865Q06J33N10Q24J059j734j069m43m80r7J31K67K9q37M58j245D86404
901374D85073k24o27J689K179J430J131o80J131O14j380J388m43L07k97l14N07D90547
886131D89013J086O30j892m91o37J235O88J9j233r52N68j0J328J315j707Q78O05D90817
869906D89731K96Q16o77J299L47j129q99j384n6q41P10k00j022K081j489j904D85204
854411D86634N23q73L95J064n8J803p82J558n86Q02r20j603r74N12Q17M02j035D87839
837923D88309p04q59q51J475j128R20j710R44j635J539L90J272P07J473J790J6D91966
$$ plain form
822175 490563 491868 490958 492423 492004 492737 491014 490891 490379 489261 487098 487181 488378 487885 488469 487989 487453 488784 489902
805413 488074 487965 490891 492020 491065 490544 488738 491091 492993 490878 492479 493516 490547 489712 488891 488250 487989
790299 487727 488656 488608 485196 486620 487855 486111 486868 486226 486025 485937 488642 490459 490107 490641 489998 491105 490939 490785
773271 490376 490352 489355 489333 488752 487751 488754 490755 489344 488408 491238 489344 489453 490782 490240 489971 489854 491238 491716
756099 493831 493751 496280 495501 495717 496963 497062 498497 498201 497670 496379 495381 497587 497520 500994 498718 499036 499921 502592
738779 501671 500161 498219 498996 499446 501255 502573 502154 504222 505249 503640 505187 505998 504008 504667 504256 504078
723163 504475 504998 503533 501517 502234 500708 501234 501813 500988 503328 502568 501922 501541 501343 500767 502218 502930 503928 503856
705564 503277 504048 504291 503923 501930 502874 501895 502042 501567 500023 498857 500068 502328 500007 500746 499612 502669 502482
$$ packed form
822175D90563J305r10J465m19P33j723j23n12j118k163Q3J197m93N84m80n36J331D89902
805413D88074j09K926J129r55n21j806K353J902k115J601J037k969q35q21o41D87989
790299D87727R29m8l412J424J235j744P57o42k01q8K705J817l52N34o43J107j66D90785
773271D90376k4r97k2n81j001J003K001j411r36K830j894J09J329n42k69j17J384D91716
756099D93831q0K529p79K16J246R9J435k96n31j291r98K206o7L474k276L18Q85E02592
738779E01671j510j942P77M50J809J318m19K068J027j609J547Q11j990O59m11E04078
723163E04475N23j465k016P17j526N26N79q25K340p60o46l81j98n76J451P12R98E03856
705564E03277P71K43l68j993R44r79J47m75j544j166J211K260k321P39j134L057E02482
$$ plain form
688753 502416 501340 501127 502845 504294 504280 506001 506297 506052 506430 503429 504099 506606 506756 509159 508799 509506 508367
671810 506590 507300 507444 506828 506897 508023 510178 506502 508295 508855 509930 510725 510157 512366 512593 512166 512627 511598 511654
653772 511123 512259 510499 510309 510587 509293 508071 507151 506943 507743 506492 505755 508741 507748 506348 508508 508226 508725
636544 508111 507956 508223 508735 507588 506094 504656 505075 503635 504387 503480 502231 503053 503331 502069 502586 502242 499209
619174 500791 502320 503259 502215 503469 504011 505449 507407 506110 505782 506110 506022 504718 507047 508076 507460 506849 508506
601667 506502 506382 505924 504483 505483 503848 505398 507679 508802 510672 510613 509322 510496 510600 509826 510237 510355 508863
584012 508146 508039 508468 507239 506999 505489 505118 502437 502957 500836 501687 500135 499751 498553 499428 498075 497747 498089
566216 497406 500129 498996 496560 494514 493084 492780 493538 492625 491107 490785 489312 485983 485121 487319 490035 494375
$$ packed form
688753E02416j076k13J718J449j4J721K96k45L78l001O70K507J50K403l60P07E08367
671810E06590P10J44o16O9J126K155l676J793N60J075P95n68K209K27m27M61j029E11654
653772E11123J136j760j90K78j294j222r20k08Q00j251p37K986r93j400K160k82E08725
636544E08111j55K67N12j147j494j438M19j440P52r07j249Q22K78j262N17l44D99209
619174E00791J529R39j044J254N42J438J958j297l28L28q8j304K329J029o16o11E08506
601667E06502j20m58j441J000j635J550K281J123J870n9j291J174J04p74M11J18E08863
584012E08146j07M29j229k40j510l71k681N20k121Q51j552l84j198Q75j353l28D98089
566216D97406K723j133k436k046j430l04P58r13j518l22j473l329q62K198K716D94375
$$ plain form
549272 503171 503357 501927 493932 486892 485012 485020 486258 484841 485975 485745 484684 484625 485801 485441 484489 483609 484182
531191 483304 483070 481021 481592 481899 481632 481077 481651 480111 480949 479527 481576 482120 480949 480762 479714 476833 476094
512959 475165 476177 475173 472175 470916 469209 467429 465669 465098 464196 462870 462427 462102 461243 461624 459752 458098
495605 457650 456855 457420 454160 455689 453851 452042 452074 450978 450052 449513 447214 444872 446566 446000 445685 443618 445322
477079 445397 445205 444490 445341 445907 445971 444535 444533 444287 445528 442871 444010 443618 442137 442593 442324 441289 439934 438432
457360 437944 437135 438376 438272 438808 444674 457596 463265 454448 440838 438026 434374 433187 430138 427937 427148
440621 427132 425587 422258 421180 420433 419988 419403 417144 415170 414514 412897 411963 410267 411689 410507 410416 408738 409544
421640 408290 407188 407394 405393 404910 404833 403942 403950 404427 403827 401920 401922 401986 401087 400935 401271 402013 401367 400039 400018 399377
$$ packed form
549272E03171J86j430p995p040j880QJ238j417J134k30j061n9J176l60r52q80D84182
531191D83304k34k049N71L07k67n55N74j540Q38j422K049N44j171j87j048k881D76094
512959D75165J012j004k998j259j707j780j760n71r02j326m43l25q59L81j872D58098
495605D57650p95N65l260J529j838j809L2j096r26n39k299k342J694n66l15k067D45322
477079D45397j92p15Q51N66O4j436kk46J241k657J139l92j481M56k69j035j355D38432
457360D37944q09J241j04N36N866J2922N669q817j3610k812l652j187l049k201D27148
440621D27132j545l329j078p47m45n85k259j974o56j617r34j696J422j182r1j678D09544
421640D08290j102K06k001m83p7q91QM77o00j907KO4q99j52L36P42o46j328k1C99377
$$ plain form
399300 400412 400516 398286 397996 397187 396846 396326 394952 393714 392898 391655 390043 388397 389907 388352 387189 385009
381052 384769 383219 383323 381878 381088 381248 380696 378887 378260 377332 375067 373648 374272 373272 373693 370873 369158 369537
361575 368593 368224 367824 368809 367112 367390 368358 367160 368315 367414 367659 368774 369489 369516 370791 373333 386914 508231
341938 894294 1180574 1074043 635702 410584 378618 373312 372282 368342 363860 361046 361382 360886 359653
326547 359106 358018 358824 357122 357351 355497 353582 353363 351317 351842 351200 350215 349831 349863 348975 347478 346142 347478
306615 346705 345760 346187 346723 345680 345173 343701 344453 343583 344088 343682 343098 343362 342412 342852 342839 343679 342751 343506 344493
284269 344650 344933 343565 343090 343863 343263 342588 343839 342935 342295 341735 341545 340857 339950 339766 338614 339521 338995 338165
262847 338907 339328 339070 339275 339070 339176 338744 337120 337005 337066 337779 336957 336071 334441 334559 334849 335210 334361 333713 334505
$$ packed form
399300D00412J04k230k90q09l41n20j374j238q16j243j612j646J510j555j163C85009
381052C84769j550J04j445p90J60n52j809o27r28k265j419O24j000M21k820j715C69537
361575C68593l69m00R85j697K78R68j198J155r01K45J115P15K7J275K542J3581E08231
341938H94294K86280j06531m38341k25118l1966n306j030l940m482k814L36m96C59653
326547C59106j088Q06j702K29j854j915k19k046N25o42r85l84L2q88j497j336C47478
306615C46705r45M27N36j043n07j472P52q70N05m06n84K64r50M40j3Q40r28P55C44493
284269C44650K83j368m75P73o00o75J251r04o40n60j90o88r07j84j152R07n26C38165
262847C38907M21k58K05k05J06m32j624j15O1P13q22q86j630J18K90L61q49o48C34505
$$ plain form
240091 334759 333246 333214 333153 332446 334255 335191 334076 333817 332785 333593 336602 353323 386159 415653 410920 374614
220579 345075 331526 328407 325665 326116 325067 325406 325393 325854 324184 324704 324067 322952 323632 322186 321386 321010 321847
199749 321959 320732 320698 320676 319657 320017 319572 318852 318129 317518 316744 315421 314106 312967 312204 309990 308117 307469 305991
177568 303814 303814 302075 299692 298489 299020 298769 296955 294837 295659 294787 293912 293042 291503 291239 290358 290700 288406 287029
155188 286784 286578 285717 284244 283953 283297 283614 283009 280584 279850 279936 279714 278647 277466 276569 274536 272928 271092 269177
132606 267414 267408 266599 264967 263031 260924 259918 258542 256390 256033 253868 253200 252072 249266 248176 246743 244602
112227 243060 241485 240317 238442 237170 235930 234739 235437 234346 233010 232767 232475 234514 236855 241790 253392 281904
91683 339790 412870 469259 473301 425296 357263 298929 258991 235785 222318 213737 207877 203420 198448
$$ packed form
240091C34759j513l2o1p07J809R36j115k59j032Q08L009J6721L2836K9494m733C74614
220579C45075j3549l119k742M51j049L39j3M61j670N20o37j115O80j446q00l76C21847
199749C21959j227l4k2j019L60m45p20p23o11p74j323j315j139p63k214j873o48C05991
177568C03814%j739k383j203N31k51j814k118Q22q72q75q70j539k64q81L42k294B87029
155188B86784k06q61j473k91o56L17o05k425p34Q6k22j067j181q97k033j608j836B69177
132606B67414oq09j632j936k107j006j376k152l57k165o68j128k806j090j433B44602
112227B43060j575j168j875j272j240j191O98j091j336k43k92K039K341M935J1602B81904
91683C39790P3080N6389M042m8005o8033n8334l9938k3206j3467q581n860m457A98448
$$ plain form
74638 195617 192720 190045 187703 185844 183586 181751
$$ packed form
74638A95617k897k675k342j859k258A81751
66073A80574  $$checkpoint
##END=