##TITLE= Raman spectrum of Cassiterite � http://rdrs.uaic.ro
##MINERAL= Cassiterite
##CHEMISTRY= SnO2
##JCAMP-DX= 5.01
##DATA TYPE= RAMAN SPECTRUM
##DATA CLASS= XYDATA
##ORIGIN= Department of Geology, UAIC, Romania
##OWNER= http://rdrs.uaic.ro � stud. Apopei Andrei Ionut
##LONGDATE= 2010/06/01 11:59:39.0916 +0300 $$ export date from JSpecView
##SPECTROGRAPHDATASYSTEM= HE 532 (Horiba Jobin-Yvon)
##XUNITS= Raman shift (1/cm)
##YUNITS= Intensity (cnt)
##XFACTOR= 3.188909E-3
##YFACTOR= 8.09799412E-4
##FIRSTX= 3399.61
##FIRSTY= -0.06847138
##LASTX= 210.701
##NPOINTS= 1024
##XYDATA= (X++(Y..Y))
1066073h5J9Q5J488j37o96J83o48r0L32J78N49n17P17r08J036p57L74j063J134A143
1049782A667r66J182n45O4K83J13l62o15K96R4k46P85L11l16k14j146J272p06J457A835
1033344B665r97M40j150J18N06l39q7J418k23r51K83P91p49j24K14j25j072M84A466
1017545B473l46L13j007Q70p20j28j532J444j1L95k31j47J40k9q0J22O81m53j99A541
1000813A815l19N61n89Q81j604M76M24N43m72P62l20l87J36N1n23n23J539n75J8A454
983929A607p95N1L55O42m90N74l04Q4n58l73J048J7n75M22n42j19j18Q45l39q5A769
966073H39o8N0n1L88Q46j8K03p95n07Q11q12M40J02l89J35j18J19%N25r47J70A127
947224A110o41j01R99K04O94j453Q47l03q61L57O95j84j046P12J88m37n05J338I40
$$ plain form
1066073 -85 -66 19 1507 1370 674 857 209 119 451 629 1178 661 1378 470 1506 749 1123 60 1194 1143
1049782 1667 701 1883 1338 1402 1685 1798 1436 821 1117 1211 965 1750 2061 1745 1531 385 1657 951 2408 1835
1033344 2665 1668 2108 958 1076 1582 1243 1156 2574 2351 1400 1683 2474 1725 1601 1815 1690 618 1102 1466
1017545 2473 2127 2440 1433 2303 1583 1455 -77 1367 1356 1751 1520 1373 1513 1484 1404 1526 2207 1754 1555 1541
1000813 1815 1496 2057 1468 2349 745 1221 1645 2188 1716 2478 2158 1771 1907 1958 1435 912 2451 1876 1894 1454
983929 1607 812 863 1218 1860 1370 1944 1640 1724 1166 793 1841 1858 1283 1705 1163 1044 926 1771 1432 1347 1769
966073 839 771 821 770 1158 2004 1986 2189 1394 887 1698 886 1326 1428 1039 1174 1056 1175 1175 1700 753 923 1127
947224 1110 469 368 1367 1571 2265 812 1659 1356 495 852 1547 1363 317 1029 1217 780 275 1613 940
930679A111l0L07j15o90M59m70J052N5l85j65n21L60k83m7Q84O14l51o37Nn19A147
912312A04L27O48L27o20R70M29m4m16J25n34m50M13L96p87K10l81j28J43K62m49A010
893766F30P86j10M65n15p52P19l79N84j326j09J109O19l79l96p51J380O1r70p4G55
875898I19R5l94Q90n46n30J449j274k24j24P56j120J026J65l43M02k58Q92j678A114
858729H90n45P91q49O4k0M70K00m26l58N38O23n44J50m76P75j89j54J114j288b84
840535F61K34q81M21J672j236L2j87m08Q27q6o94J17j20J34P94j439R63J18l06B43
822175B3O08J00N24J51J52l05o43O08k20K53n76J52Q4j86j69N91k03j7J35j02H08
802754D36J166J7j251J01N1M90Q29j167Q29p78M73L38q11L89r98O8K53Q46j015A230
$$ plain form
930679 1111 1081 1388 1273 583 1042 572 1624 1679 1294 1129 608 968 685 638 1522 2136 1785 1148 1153 634 1147
912312 104 431 1079 1406 786 1756 2185 2141 1725 1850 1316 866 1279 1675 888 1098 717 589 732 994 545 1010
893766 630 1416 1306 1771 1256 504 1223 844 1428 102 -7 1102 1721 1342 946 195 1575 1636 666 592 755
875898 919 1014 620 1510 964 434 1883 609 385 261 1017 -103 923 1088 745 1147 889 1781 103 1114
858729 890 345 1136 287 351 331 801 1001 575 217 755 1378 834 984 508 1283 1094 940 2054 766 -284
840535 661 895 14 435 2107 871 903 716 308 1135 1049 355 472 352 486 1280 -159 804 922 616 243
822175 23 631 731 1255 1406 1558 1253 610 1218 998 1251 675 827 911 725 556 1147 944 927 1062 960 808
802754 436 1602 1619 368 469 520 1010 1839 672 1501 723 1196 1534 723 1112 114 182 435 1281 266 1230
784042I77m74K20j52K87L89N92j218j18j52k03N07o76R97O77o09j53l55J86N24A161
765155E18J015j455K87L89j52J68N41k20q97P44M73r98J34j7O7L04M05j218N91A016
746089A422K52o26j36J51J68j8q5q6l05k38N74j083N73q5P42K36J656n26j489G57
726847A466j355J808o27j71r31O74M9L54l24j87N56j21L2l6p12M04k05l91J486A124
707424D79O40j135P25k39Q93n09p64J164n94P07l91R9Q25j152k57lP42n44K33E61
687815A268j89m09J32q7p14M03R8M87p64M53m43R60l92R8p1Q42j154P07n62l76A332
667078F69o13J451n11n62l8Q92K67k75p1n96j40L85m27J298r51P74n63j90J99I77
647090B071j594l59J585j442P57k92R7J246j306M69m78O88k07n63M6q84M18J449e19
$$ plain form
784042 977 503 723 571 858 1247 1839 621 503 351 148 655 -21 976 1653 1044 891 536 722 1246 1161
765155 518 1533 78 365 754 602 770 1311 1091 194 938 1411 413 547 530 597 901 1306 88 679 1016
746089 1422 1674 1048 912 1063 1231 1213 1128 1042 737 499 1073 -10 563 478 1220 1456 3112 2586 1097 757
726847 1466 111 1919 1292 1121 190 864 913 1267 943 756 1312 1191 1223 1187 475 879 674 283 1769 1124
707424 479 1119 -16 709 470 1363 854 90 1254 660 1367 976 1075 1900 748 491 488 1230 686 919 561
687815 1268 1079 670 802 715 1 404 502 989 225 678 235 1195 803 901 830 1672 518 1225 663 287 1332
667078 669 56 1507 996 434 396 1288 1555 1280 1209 613 473 858 431 1729 778 1552 989 799 998 977
647090 2071 477 118 1703 261 1018 726 823 2069 763 1232 754 1442 1235 672 718 -166 252 1701 -519
627876G62L67J13o47m79N03l94P39O71o31k58j24l43k2N35o14O38r0K99O2p3k25F82
605568D73M68p32L83n47M5J81R75o32K31j054J448m29K65n98R58P38j25q01k93D06
584996A431p84j08O87r54O02k43J160r71K13j25J45n48j09J0j43Q05n83pO01n32D9
563233D97O01p01J78N83m99k5r3P6n50Q03j11o68P01q04L62M64j96L96N99r74B40
541254H89m50K09J92R0k8Np89M45M95k9j64K92l34Q16p91L42J491j671K06M43B101
519052A850j216J118m71M58o7M91j216J099J02n42j7K70L37p12M38o10J485j71B944
498675B907n62Q93j57K008K32N35N53J313Q72J042M66J497J700J277J77J039l48A6533
479145A9160j144Q00R35J036j806Q8n72k17Q6o75j403O94j506j36m58K18j38j812A3095
$$ plain form
627876 762 1129 1242 595 116 619 225 964 1635 1004 746 622 279 257 792 178 816 726 1025 1087 1014 789 682
605568 473 941 209 592 45 90 271 1246 614 845 -209 1239 810 1075 477 1435 2173 2048 1247 954 406
584996 1431 647 539 1226 272 874 631 1791 820 1033 908 1053 505 396 406 263 1068 485 478 1079 547 49
563233 497 1098 397 575 1158 659 634 541 617 67 870 759 91 792 -12 350 814 618 1014 1613 639 240
541254 889 439 648 840 930 902 907 118 563 1058 1029 865 1157 823 1639 848 1190 2681 1010 1216 1659 2101
519052 1850 634 1752 1281 1739 1672 2163 947 2046 2148 1606 1589 1859 2196 1484 1922 1312 2797 2626 2944
498675 2907 2345 3238 3081 5089 5321 5856 6409 7722 8594 9636 10102 11599 13299 14576 14753 15792 15444 16533
479145 19160 18016 18816 19751 20787 18981 19069 18497 18280 18366 17691 16288 16982 15476 15340 14882 15100 14962 13150 13095
458401A3040j23j223O1p00o16j27n84j244r74J088l32j247n71k00R83n05O09J218G267
437469F708K18Q76K50J517j663L49j59j006k96M13j380o04m01R34p93k18q44P43D711
416340D759K34n5N36j08J397j362N49J444P49k329P1Q48N76j032J00M38j357N87F023
395019F404l63j28R1j855R50Lk36n75l23q7K84O2j478o34K45J003o21q1q77K54B105
371334B678q16Q41j055R38j633K43J188j49R99n08J605j847J010J279K5m49p38C276
350684D107j6p62l23N20j173n65Pn86J949k009J70j438J214o80J685j513Q53R18B142
328752B922K384J6m10R59K30k140J055m69Q7K37j320R44j392m1J27j1l50J998E621
306615F584K550J517l253M98k801k83Q14j893L54j424J2k595J987J003j264n89B722
$$ plain form
458401 13040 12917 11694 11755 11055 10439 10312 9728 8484 7510 8598 8266 7019 6448 6248 7231 6726 7335 8553 7267
437469 6708 6926 7802 8052 9569 7906 8255 8096 7090 6794 7207 5827 5223 4822 5756 4963 4745 3901 4644 4711
416340 4759 4993 4938 5474 5366 6763 5401 5950 7394 8143 5814 5885 6733 7309 6277 6377 6815 5458 6045 6023
395019 6404 6041 5913 6004 4149 5099 5102 4866 4291 3968 3881 4165 4227 2749 2115 2360 3363 2742 2661 1784 2038 2105
371334 2678 1862 2703 1648 2586 953 1196 2384 2235 3234 2726 4331 2484 3494 4773 4798 4349 3611 3276
350684 4107 4091 3329 3006 3526 2353 1788 1795 1209 3158 1149 1319 -119 1095 415 2100 587 1440 2358 2142
328752 2922 5306 5322 4912 5871 6101 3961 5016 4547 4634 4871 3551 4495 3103 3062 3189 3178 2828 4826 5621
306615 6584 9134 10651 7398 7896 5095 4812 5626 3733 4087 2663 2675 80 2067 3070 1806 1217 2722
286513B196p1J364m47J344J410J018J896J708J622K702J686J853J276J478j450A8979
267373A8388J85p47k862j072q20M1k82M215J947N056L854N510O827R751N792P380H0316
246940A02303L6562M8921M2697R097l5547n6448n3119k8720j3180q650q40o404C7792
230928C5512Q47m90K570j88j947m570J518L15R41J0510P060L712n00l494m424D9035
211343D7822N331M181P816J5222K1630L4600O1097J24761K22077K67276J87668I74100
196260G41799k65833j82319r9104n5308k6831k3483j4723j3489j0781o131p567C1267
181083B8978m182J399j339k454J099q4k17L404k429J580k594m181j474j168L722B4207
161097B9253M457N288L227L942K608k97Q533P792K0495K4524J0559p141k2896F8128
$$ plain form
286513 2196 2125 3489 3042 4386 5796 6814 8710 10418 12040 14742 16428 18281 19557 21035 19585 18979
267373 18388 18573 17826 14964 13892 13072 13113 12831 17046 18993 24049 27903 33413 40240 49991 55783 63163 80316
246940 102303 138865 187786 230483 239580 204033 147585 94466 65746 52566 43916 43076 36672 37792
230928 35512 36359 35869 38439 38251 36304 31734 33252 33567 34508 45018 52078 55790 55290 51796 47372 49035
211343 47822 53153 57334 65150 80372 102002 136602 197699 322460 544537 811813 999481 974100
196260 741799 475966 293647 194543 139235 112404 88921 74198 60709 49928 43797 36230 31267
181083 28978 24796 26195 24856 22402 23501 23417 23200 26604 24175 25755 23161 18980 17506 16338 20060 24207
161097 29253 33710 38998 42225 46167 48775 48478 57011 64803 85298 109822 120381 113240 90344 68128
143328E3863j1774m262M485M237L18m344o503r676j0567j718j22J439r39L718A3593
124234A4230Q12L795l012L27J230k449Q57J592L832L316J80M76J145k549j847B1857
103788A7341O34k229k997n51m210m520k64l297J83N199Q526P558Q940L64k465B1433
83175A4093m909k205R021J2806J7049J2229J4290O646L450j691k925k062G1042
$$ plain form
143328 53863 42089 37827 42312 46549 46867 42523 36020 26344 15777 14059 13937 15376 14437 18155 13593
124234 14230 15042 18837 15825 16152 17382 14933 15790 17382 21214 24530 24710 25186 26331 23782 21935 21857
103788 17341 17975 15746 12749 12198 7988 3468 3204 -93 90 5289 13815 21373 30313 30677 28212 21433
83175 14093 9184 6979 16000 28806 45855 58084 72374 79020 82470 80779 77854 75792 71042
66073F5785  $$checkpoint
##END=