##TITLE= Raman spectrum of Celestine � http://rdrs.uaic.ro
##MINERAL= Celestine
##CHEMISTRY= SrSO4 
##JCAMP-DX= 5.01
##DATA TYPE= RAMAN SPECTRUM
##DATA CLASS= XYDATA
##ORIGIN= Department of Geology, UAIC, Romania
##OWNER= http://rdrs.uaic.ro � stud. Apopei Andrei Ionut
##LONGDATE= 2009/11/08 01:27:13.0199 +0200 $$ export date from JSpecView
##XUNITS= Raman shift (1/cm)
##YUNITS= Intensity (cnt)
##XFACTOR= 3.188736E-3
##YFACTOR= 3.26966545E-3
##FIRSTX= 3399.97
##FIRSTY= 0.17055949
##LASTX= 211.234
##NPOINTS= 1024
##XYDATA= (X++(Y..Y))
1066244E2O21R48m24kQ45o63j28o7n14M82q73k3rP38q3m9n29J81n6k12N8N27q92D06
1046832F90j67J99j29r4N8o50J26N88L33J45m15J37K7o1L60l16K0K73k45K67l1F37
1028787A287j39J60k2K51j497J55M91J92k74M95n66p4j2n3Q78L54J76j36m73N1F75
1011360H99r17R8J306m79k92O76n50L81l15k84M98J60m30l77K47N51J68j94m8n25D25
993764I68o4N19N2n28l22J95q7R51l06K22k99k30J19p33Q45q4m12P16o14l4J253A549
975189A479k13o81N93K24j20j5J28m35N1k03p8K01J97k04N88q78M99K79n95J89A869
957251A548j46K39l38j02P9o90R51l72K05J2k03N56n79l59o55J105m2L92j68QA739
939137A421P37p07l12j69P6O8O72L2n84q31O51M23oN05m17J20j09K36K22m3o87A426
$$ y = [52, 673, 1621, 1197, 1195, 2040, 1377, 1249, 1182, 668, 1150, 277, 254, 245, 983, 900, 851, 322, 503, 447, 235, 293, 820, -72, 406, 690, 523, 722, 593, 499, 557, -93, 33, 621, 954, 1099, 684, 821, 848, 787, 1147, 831, 851, 1124, 879, 1146, 1115, 637, 1287, 1148, 1308, 1286, 1537, 40, 195, 686, 878, 604, 1099, 533, 459, 447, 394, 1272, 1626, 1802, 1666, 1193, 1244, 675, 899, -18, 80, 1386, 907, 615, 1291, 741, 1122, 807, 523, 1021, 1181, 751, 374, 621, 1172, 1340, 1146, 1098, 573, 425, 968, 904, 1423, 1475, 947, 625, 820, 733, 1684, 1378, 1600, 1301, 1071, 1190, 457, 1302, 1218, 806, 1522, 908, 874, 2127, 1549, 1479, 1266, 585, 1178, 1402, 1282, 1267, 1395, 960, 1011, 808, 730, 931, 1128, 924, 1512, 634, 1133, 1412, 817, 1006, 1869, 1548, 1402, 1641, 1303, 1201, 1280, 590, 1541, 1169, 1374, 1386, 1183, 1739, 1160, 801, 146, 1251, 1209, 1601, 1433, 1441, 1739, 1421, 2158, 1451, 1139, 970, 1046, 1114, 1786, 1818, 1234, 403, 1054, 1477, 1471, 1976, 1559, 1679, 1570, 1806, 2028, 1985, 1298, 1426]
920013A104j07l06L76R5J01J60j55M06o10k02K76M67q78K31O96J22k43n4o38N36I24
901542E94R7o82q2J045K79J86J96N30p92Q32m75K71K64n4k80K17M07r54km5k38A468
882042A856p65O33l05N28L9k49J99m91R5k99L47M96O2o48K97nn02O87l36M91JB083
862342A135J64K69L09J59k48q3L29j10j19q0m81N30N11j005k30Q29j8l55J6K61A305
843312A841j93M20Q5j70L37k34J65k00k63M79k27J45j185j1p5K61O32p14R4J116A772
824098A601N5l56J02M26l99L70p17k13J12M83m99l7q93P6N26J98J16L9J0m91k86D88
803811F24P76l78k89k98O04K62p15J025o16k21j12j08J40L76k17r1K10n98K74B43
785104IJ65K02L94j40K06m7M38l91K63l84O27m07l40l60N26m5J15P78O15L01Q6B926
$$ y = [1104, 997, 691, 1067, 1162, 1263, 1423, 1268, 1674, 1064, 862, 1138, 1605, 727, 958, 1654, 1776, 1533, 1479, 841, 1377, 924, 594, 691, 9, -73, 972, 1251, 1437, 1633, 2163, 1371, 2203, 1728, 1999, 2263, 2209, 1929, 2146, 2553, 1599, 1597, 1552, 1314, 1468, 1856, 1091, 1724, 1419, 1947, 1986, 1737, 1936, 1445, 1540, 1241, 1588, 2084, 2146, 1498, 1795, 1790, 1288, 1975, 1639, 2130, 2131, 2083, 1135, 1299, 1568, 1877, 2036, 1788, 1705, 2034, 1924, 1805, 1725, 1244, 1774, 2285, 1280, 1050, 1879, 1861, 1506, 1522, 1783, 1305, 1841, 1648, 2068, 2153, 1983, 2320, 2086, 2251, 2051, 1788, 2267, 2040, 2185, 1000, 989, 914, 1175, 1807, 1093, 1187, 2303, 1772, 1601, 1656, 1300, 1402, 1828, 1429, 1799, 1082, 869, 981, 1464, 965, 928, 35, 111, 637, 835, 951, 990, 1000, 509, 223, 488, 624, 1400, 1022, 733, 435, 1039, 1301, 586, 1611, 995, 774, 662, 554, 694, 1070, 853, 762, 972, 374, 648, 243, 9, 174, 376, 770, 630, 836, 789, 1227, 836, 1099, 715, 1342, 935, 595, 235, 761, 716, 831, 1609, 2224, 2525, 2611, 2926]
764419B747L88p19k12n73p58O91j61r17O5p44J501Q5p0N7K25K99o10R1j82K80B11
744433H03J19K34o14O63L11j36kL3j74l44R20k43n72P09L74m91L21n10J36n5r5A289
723330A301J44P95k43n17M01O54r48j6j04n82K83K31J42j79q0R6n6K90l41K47A099
702940A718m35k4K78op22O30j2l66j14Q21r46R51r45O50l77m6o1k18r7P08n61C02
681408A101N01m83m6J232n52M2j285Q92L44p69N97K60j28K07m69k64N43k32P52B466
661554A846j28P7np97L30J9q16O20P63j39J83q67j45J25p4n22R05N43Q0o89l9A099
639592G52j84R57K08m02M20m24l98l87L82q57J082J51l23m7P8m51m41K0J7O1J17A76
617405H2M23j31N20P95J32L08j02o60M45k84J64K17o32Q28jo34j04L0K25R9p59A257
$$ y = [2747, 3135, 2416, 2204, 1631, 873, 1564, 1403, 486, 551, -193, 1308, 1393, 1323, 1380, 1605, 1904, 1294, 1385, 1203, 1483, 211, 803, 922, 1156, 542, 1205, 1516, 1380, 1378, 1411, 1237, 893, 1813, 1570, 998, 1707, 2081, 1590, 1911, 1401, 1537, 1482, 1387, 1289, 1301, 1445, 2240, 1997, 1480, 1881, 2535, 1587, 1571, 1467, 885, 1168, 1399, 1541, 1362, 1282, 1378, 1322, 1612, 1271, 1518, 1099, 1718, 1283, 1259, 1537, 1531, 809, 1439, 1427, 1061, 947, 1768, 822, 1773, 828, 1478, 1101, 1055, 994, 776, 679, 1387, 826, 302, 1101, 1602, 1119, 1073, 2305, 1753, 1795, 510, 1402, 1746, 977, 1574, 1834, 1706, 1913, 1444, 1180, 1723, 1491, 2243, 2466, 1846, 1718, 1795, 1790, 993, 1323, 1342, 526, 1146, 1909, 1770, 1953, 1086, 941, 1066, 992, 470, 1375, 1918, 1998, 1309, 1270, 1099, 752, 568, 1525, 1733, 1331, 1751, 1327, 929, 542, 924, 67, 1149, 1300, 977, 930, 1008, 557, 116, 136, 153, 214, 331, 176, 82, 505, 374, 894, 1689, 1821, 2129, 2027, 1367, 1812, 1528, 1692, 1909, 1277, 2105, 2104, 1470, 1366, 1396, 1621, 1720, 961, 1257]
594985A377J148j142L79J033m16m42J91k20N9O53j164P89lj89m10J4j75r87K76A051
574309A318K17k36j318o4k4J037M77J22N80O3k92m01P69o23N61M51l11k91L33B216
553439B370J17P21M8p51q2M53Kp01L76L41O8q40P52L60K9k90k82M63j10M37k36C735
530348C177k76J79J22LJ85K02l26L81n08L71J26m05K44l81O52r05L60j99n08Q75C013
508038B621j70K22L87o18k00m25J090l36k67K2k27j27L2l96M99j15j01m30Q90A932
486528A565M78p15P43J87p72J86l3M68K29q06N51l65J89j97k09L27m55O23J84B160
464814B490o34L13J64M62K69m56R7J73o76m90K78m3j49L67O6j70m4J29m06j61A143
441840A317R53l14q74K79M15p29R29n0o70j03P26j009J2Q11K97j87o22N2l84P70A216
$$ y = [1377, 2525, 1383, 1762, 2795, 2379, 1937, 2128, 1908, 1967, 2620, 1456, 2245, 2242, 2053, 1643, 1657, 1482, 495, 771, 1051, 1318, 1535, 1299, -19, -83, -107, 930, 1407, 1529, 2109, 2172, 1880, 1479, 2248, 1625, 2186, 2637, 2326, 2035, 2368, 2216, 2370, 2487, 3208, 3256, 2505, 2423, 2876, 2878, 2177, 2553, 2894, 2962, 2122, 2874, 3234, 3263, 2973, 2691, 3154, 3044, 3481, 3245, 3735, 3177, 2901, 3080, 3202, 3205, 3390, 3592, 3266, 3647, 3139, 3510, 3636, 3231, 3475, 3094, 3746, 2841, 3201, 3002, 2494, 3369, 3013, 2621, 2451, 2673, 3060, 2442, 2242, 1817, 2907, 2571, 2304, 2326, 2099, 1972, 2004, 1608, 2107, 1992, 1891, 1461, 2351, 1932, 1565, 2043, 1328, 2071, 2258, 1486, 1672, 1639, 2107, 2336, 1530, 2081, 1716, 1905, 1708, 1499, 1826, 1371, 1994, 2178, 2160, 2490, 1856, 2169, 2333, 2795, 3064, 2608, 2705, 2878, 2202, 1712, 1990, 1947, 1798, 2165, 2231, 2061, 2017, 2146, 1740, 1579, 1143, 1317, 2270, 1956, 1082, 1361, 1776, 1047, 1976, 1926, 1256, 1153, 1879, 870, 882, 1693, 1990, 1803, 1181, 1233, 849, 1619, 1216]
418630A641J63N0J52l78K95r4L54P9N29Q2l07K37n69l53j6L4j52O97j33J30O89C398
394115C338mN2N2n98L97n92J97L59M33m70k08J7o79K03k22N63N94J385N67J85E797
370420F015J915L746P956J3532J3672L523q626j4245j1305n761l795o02j714n86C849
353036C236K590L438N408K069k340l634j535j06j038j486j757j562l35r3L08k39B555
333323C042K38k12M44J48M77l7J621O89J916K099L113M804J0516L2747J69867F41294
314554I99764o7652m49572l40069r9120j9939p334l905l248k227j982j242l31B581
298986B205q97N06l79k04J82K68j60L3k72j43L7k25j2k65n55M02N56q77O23o58F09
274315F72j42J56m80J57m10N52k56N5j03k82M54k41L65o5o8N36m82M3j56M98L7a4
$$ y = [1641, 1804, 1854, 2006, 1628, 1923, 1829, 2183, 2262, 2791, 2873, 2566, 2803, 2234, 1881, 1865, 1899, 1747, 2444, 2311, 2441, 3130, 3398, 3338, 3334, 3386, 3438, 2840, 3237, 2645, 2842, 3201, 3634, 3164, 2956, 2973, 2294, 2497, 2275, 2838, 3432, 4817, 5384, 5569, 5797, 6015, 7930, 11676, 19632, 33164, 46836, 50359, 41733, 27488, 16183, 10422, 6627, 6025, 4311, 3725, 3849, 3236, 5826, 9264, 14672, 16741, 14401, 10767, 9232, 9126, 8088, 6602, 4845, 3283, 2948, 2855, 3163, 2924, 2555, 3042, 3280, 3068, 3512, 3660, 4137, 4100, 5721, 6410, 8326, 10425, 13538, 18342, 28858, 61605, 231472, 641294, 999764, 932112, 482540, 142471, 43351, 23412, 16078, 12173, 8925, 6698, 4716, 3474, 3143, 2581, 2205, 1308, 1814, 1435, 1231, 1413, 1681, 1521, 1554, 1282, 1139, 1176, 951, 939, 674, 119, 521, 1077, 200, 823, 165, 609, 672, 530, 686, 206, 363, -47, 505, 249, 304, 201, -81, 373, 132, 497, 432, 364, 900, 418, 461, 305, 803, 840, -14]
248249F15r4L20m6k62N98k55m42J78j10P12j59l70k41j41L34pk38M0l10N06k24B28
221900b36Q10k01O22l49L48j86P14j58j37N04J690J941J397J613L331J0510J3269D4369
199918D2610k160O783J2029O532q217j9474j7387j1100l749j183j735l19jk84A762
181253A078P41k75r0K30j74l86L54n94M19J30n75N9P52M61L75o2J54M70O06J7D645
155358F138J991K877M760J0281L1010O1255P8758O4959J2541m5444p2382o5203D5418
138738B2406j0424l540k267n89r99o81P1l13l92l52k79p4k82j50K65n34j36k73A603
114803A463K64r4n7p8J97k57J04k31q9o74Q69r33K01J77j89m24J52K90n00L89E69
88210E98j72K3l76j87K32m8K63k60M20k29l96K56J48l31L8N51E38
$$ y = [615, 521, 841, 795, 533, 1131, 876, 434, 612, 502, 1214, 1055, 685, 444, 303, 637, 630, 392, 432, 122, 628, 404, 228, -236, 574, 373, 995, 646, 994, 808, 1522, 1364, 1227, 1731, 3421, 5362, 6759, 8372, 11703, 22213, 35482, 44369, 42610, 40450, 47233, 59262, 65794, 57577, 38103, 20716, 9616, 5867, 4684, 2949, 2630, 2629, 2345, 1762, 1078, 1819, 1544, 1454, 1684, 1510, 1124, 1478, 884, 1303, 1433, 858, 917, 1669, 2130, 2505, 2443, 2597, 3067, 3673, 3690, 4645, 6138, 8129, 11006, 15766, 26047, 57057, 118312, 197070, 262029, 274570, 229126, 156744, 91541, 45418, 22406, 11982, 8442, 6175, 5586, 4587, 3906, 3977, 3664, 3272, 2920, 2641, 2567, 2285, 2135, 2400, 1866, 1730, 1457, 1603, 1463, 1727, 1633, 1576, 1498, 1695, 1438, 1542, 1311, 1222, 548, 1417, 484, 685, 862, 673, 249, 401, 691, 191, 580, 569, 598, 426, 449, 73, -114, 118, 70, 333, 73, 493, 264, -132, 124, 272, -59, -21, 530, 538]
66244A341  $$checkpoint
##END=