##TITLE= Raman spectrum of Chalcocyanite � http://rdrs.uaic.ro
##MINERAL= Chalcocyanite
##CHEMISTRY= CuSO4
##JCAMP-DX= 5.01
##DATA TYPE= RAMAN SPECTRUM
##DATA CLASS= XYDATA
##ORIGIN= Department of Geology, UAIC, Romania
##OWNER= http://rdrs.uaic.ro � stud. Apopei Andrei Ionut
##LONGDATE= 2009/11/08 03:12:23.0664 +0200 $$ export date from JSpecView
##XUNITS= Raman shift (1/cm)
##YUNITS= Intensity (cnt)
##XFACTOR= 3.188736E-3
##YFACTOR= 1.0022202E-4
##FIRSTX= 3399.97
##FIRSTY= 0.58465296
##LASTX= 211.234
##NPOINTS= 1024
##XYDATA= (X++(Y..Y))
1066244 5834 5834 5834 5834 4919 4746 4573 4400 4226 4053 3880 3707 3533 3594 3594 3594 3594 3594 3594 3594 3594 3594 3594 3594 3594 3594 3594 3594 3594 3594 3594 3594 3594 3594 3594 3594 3594 3594 3594
1035868 3594 3594 3594 3594 3594 3594 3594 3594 3594 3594 3594 3594 3594 3594 3594 3594 3594 3594 3594 3594 3594 3594 3594 3594 3594 3594 3594 3594 3594 3594 3594 3594 3594 3594 3594 3594 3594 3594 3594 3594 3594 3594 3594 3594 3594 3594 3594 3594 3594 3594 3594 3594 3594 3594 3594 3594 3594 3594
989743 3594 3594 3594 3594 3594 3594 3594 3594 3594 3594 3594 3594 3594 3594 3594 3594 3594 3594 3594 3594 3594 3594 3594 3594 3594 3594 3594 3594 3594 3594 3594 3594 3594 3594 3594 3594 3594 3594 3594 3594 3594 3594 3594 3594 3594 3594 3594 3594 3594 3594 3594 3594 3594 3594 3594 3594 3594 3594
942442 3594 3594 3594 3594 3594 3594 3594 3594 3594 3594 3594 3594 3594 3594 3594 3594 3594 3594 3594 3594 3594 3594 3594 3594 3594 3594 3594 3594 3594 3594 3594 3594 3594 3594 3594 3594 3594 3594 3594 3594 3594 3594 3594 3594 3594 3594 3594 3594 3594 3594 3594 3594 3594 3594 3594 3594 3594 3594
893934 3594 3594 3594 3594 3594 3594 3594 3594 3594 3594 3594 3594 3594 3594 3594 3594 3594 3594 3594 3594 3594 3594 3594 3594 3594 3594 3594 3594 3594 3594 3594 3594 3594 3594 3594 3594 3594 3594 3594 3594 3594 3594 3594 3594 3594 3594 3594 3594 3594 3594 3594 3594 3594 3594 3594 3594 3594 3594
844181 3594 3594 3594 3594 3594 3594 3594 3594 3594 3594 3594 3594 3594 3594 3594 3594 3594 3594 3594 3594 3594 3594 3594 3594 3594 3594 3594 3594 3594 3594 3594 3594 3594 3594 3594 3594 3594 3594 3594 3594 3594 3594 3594 3594 3594 3594 3594 3594 3594 3594 3594 3594 3594 3594 3594 3594 3594 3594
793142 3594 3594 3594 3594 3594 3594 3594 3594 3594 3594 3594 3594 3594 3594 3594 3594 3594 3594 3594 3594 3594 3594 3594 3594 3594 3594 3594 3594 3594 3594 3594 3594 3594 3594 3594 3594 3594 3594 3594 3594 3594 3594 3594 3594 3594 3594 3594 3594 3594 3594 3594 3594 3594 3594 3594 3594 3594 3594
740779 3594 3594 3594 3594 3594 3594 3594 3594 3594 3594 3594 3594 3594 3594 3594 3594 3594 3594 3594 3594 3594 3594 3594 3594 3594 3594 3594 3594 3594 3594 3594 3594 3594 3594 3594 3594 3594 3594 3594 3594 3594 3594 3594 3594 3594 3594 3594 3594 3594 3594 3594 3594 3594 3594 3594 3594 3594 3594
687047 3594 3594 3594 3594 3594 3594 3594 3594 3594 3594 3594 3594 3594 3594 3594 3594 3594 3594 3594 3594 3594 3594 3594 3594 3594 3594 3594 3594 3594 3594 3594 3594 3594 3594 3594 3594 3594 3594 3594 3594 3594 3594 3594 3594 3594 3594 3594 3594 3594 3594 3594 3594 3594 3594 3594 3594 3594 3594
631902 3594 3594 3594 3594 3594 3594 3594 3594 3594 3594 3594 3594 3594 3594 3594 3594 3594 3594 3594 3594 3594 3594 3594 3594 3594 3594 3594 3594 3594 3594 3594 3594 3594 3594 3594 3594 3594 3594 3594 3594 3594 3594 3594 3594 3594 3594 3594 3594 3594 3594 3594 3594 3594 3594 3594 3594 3594 3594
575300 3594 3594 3594 3594 3594 3594 3594 3594 3594 3594 3594 3594 3594 3594 3594 3594 3594 3594 3594 3594 3594 3594 3594 3594 3594 3594 3594 3594 3594 3594 3594 3594 3594 3594 3594 3594 3594 3594 3594 3594 3594 3594 3594 3594 3594 3594 3594 3594 3594 3594 3594 3594 3594 3594 3594 3594 3594 3594
517192 3594 3594 3594 3594 3594 3594 3594 3594 3594 3594 3594 3594 3594 3594 3594 3594 3594 3594 3594 3594 3594 3594 3594 3594 3594 3594 3594 3594 3594 3594 3594 3594 3594 3594 3594 3594 3594 3594 3594 3594 3594 3594 3594 3594 3594 3594 3594 3594 3594 3594 3594 3594 3594 3594 3594 3594 3594 3594
457529 3594 3594 3594 3594 3594 3594 3594 3594 3594 3594 3594 3594 3594 3594 3594 3594 3594 3594 3594 3594 3594 3594 3594 204 367 529 692 854 1017 1180 1343 1355 1355 1355 1355 1355 1355 1355 1355 1355
415450 1355 1355 1355 1355 1355 1355 1355 1355 1355 1355 1355 1355 1355 1355 1355 1355 1355 1355 1355 1355 1355 1355 1355 1355 1355 1355 1355 3268 4871 6473 22656 82375 121445 251667 320449
377987 399910 289860 161643 78713 42224 62271 23212 13170 10262 5419 1355 1355 1355 1355 1355 1355 1355
359572 1355 1355 14483 12552 12552 26158 16213 21857 56058 54778 72246 184322 247362 386551 315750 262834
342104 118766 53732 45521 43654 -2690 24022 7758 56393 106760 157705 393542 631978 896660
327820 991164 794051 487330 363195 232715 270686 396345 515660 750064 788327 635065 375655
314554 251526 155667 106535 8369 33945 9423 156 -939 -2126 -3190 -4256 -5322 -6388 -7455 -8788
297870 -8788 -8788 -8788 -8788 -8788 -8788 -8788 -8788 -8788 -8788 -8788 -8788 -8788 -8788 -8788 -8788 -8788 -8788 -8788 -8788 -8788 -8788 -8788 -8788 -8788 -8788 -8788 -8788 -8788 -8788 -8788 -8788 -8788 -8788 -8788 -8788 -8788 -8788 -8788 -8788 -8788 -8788 -8788 -8788 -8788 -8788 -8788 -8788 -8788 -8788 -8788 -8788 -8788 -8788 -8788 -8788 -8788 -8788
232245 -8788 -8788 -8788 -8788 -8836 -8194 -8070 -7218 -6417 -5734 -5370 -5005 -4150 -3244 -1591 62 2023 28654 60766 85955 68167
208040 50955 28702 19420 12762 -3928 -3929 -5951 -2919 66864 110964 183628 204082 191660 179242 168557
190603 141145 90950 57775 31238 2479 -934 -3928 -3515 -3835 -4084 -4333 -4583 -4548 -4548 -4548 -4548 -4548 -3308 -3308 -3218
167162 -1442 2118 83422 110792 121145 151402 121664 96255 85559 46777 26995 14075 14671 14117
150620 17894 17661 11824 -1214 -1 -2396 2866 23177 37296 37697 36695 48046 60769 108407 134638
132775 140393 132305 70568 45175 5325 6545 2470 913 692 412 412 492 -217 -1103 -1989 1631 6178 49177
111193 64401 120743 154808 128592 76709 77615 32667 20581 19437 -1497 -2068 -2068 -2068 -2068 -2147 -2350 38142 75273
89425 102597 187610 244644 298793 283139 220861 194723 151543 136981 141818 133184 98655 37355 1032
72365 1032 1020 971 923 875
66244H25  $$checkpoint
##END=