##TITLE= Raman spectrum of Charoite � http://rdrs.uaic.ro
##MINERAL= Charoite
##CHEMISTRY= K(Ca,Na)2Si4O10(OH,F)�H2O
##JCAMP-DX= 5.01
##DATA TYPE= RAMAN SPECTRUM
##DATA CLASS= XYDATA
##ORIGIN= Department of Geology, UAIC, Romania
##OWNER= http://rdrs.uaic.ro � stud. Apopei Andrei Ionut
##LONGDATE= 2010/09/11 18:29:43.0865 +0300 $$ export date from JSpecView
##SPECTROGRAPHDATASYSTEM= HE 532 (Horiba Jobin-Yvon)
##XUNITS= Raman shift (1/cm)
##YUNITS= Intensity (cnt)
##XFACTOR= 3.188909E-3
##YFACTOR= 4.3370575E-4
##FIRSTX= 3399.61
##FIRSTY= 199.5968771
##LASTX= 210.701
##NPOINTS= 1024
##XYDATA= (X++(Y..Y))
1066073D60213N570Q117m579J800L110j824k694l330M114K815J714P47k791K411D75834
1053674D78308j433J384O24M419K216M395l648M861m335J788O98n607L660Q21l563D86644
1040406D94198N069l869K804P83k326L196K69N215l403R8N631m664Q94N729k08E08951
1027041E08694K485J273K375j383p96L832M04J71j640R745q20M9N852r43l92q07E29714
1012782E25748M273k572K094O37N313m273L440L55Q08q44J922M309p4j995M065E41088
999213E45238P933J273j285j481K289r92L244l317M860J224J763Q33L575L06j518E66601
985544E70164m566L880j249M738M9J543L893j653O281K69L195L624p3l232K338E92911
971774E91858k461L355n510K094O85M506K498J884K030K159q09Q434J164k106F19145
$$ y = [460213, 465783, 473900, 469321, 471121, 474231, 472407, 469713, 466383, 470497, 473312, 475026, 475773, 472982, 475393, 475834, 478308, 476875, 478259, 478883, 483302, 485518, 489913, 486265, 491126, 486791, 488579, 489277, 483670, 487330, 488151, 484588, 486644, 494198, 499267, 495398, 498202, 498985, 496659, 499855, 500124, 505339, 501936, 502034, 507665, 503001, 503895, 509624, 509416, 508951, 508694, 511179, 512452, 514827, 513444, 512648, 516480, 516884, 517055, 515415, 525160, 524340, 524389, 530241, 529298, 528906, 528099, 529714, 525748, 530021, 527449, 529543, 530180, 535493, 531220, 534660, 535015, 535823, 534979, 536901, 541210, 541136, 539141, 543206, 541088, 545238, 553171, 554444, 553159, 551678, 553967, 552975, 556219, 552902, 557762, 558986, 560749, 561582, 565157, 565463, 563945, 566601, 570164, 565598, 569478, 568229, 572967, 573016, 574559, 578452, 576799, 583080, 583349, 586544, 590168, 590095, 586863, 589201, 592911, 591858, 589397, 592752, 587242, 589336, 590021, 594527, 597025, 598909, 600939, 603098, 602289, 610723, 611887, 609781, 619145]
958720F21083l023K051o12p600Q044M74m74M847n009N501j289K069R076k513l095F30873
944753F35234o71Q554o305N537M121k093K339J116K316K165K940L179o779j481F51491
931510F53975j2R244K280L659L30m469O515k622M079j961J740j752N819K627J080F78930
917339F78720M626N411K927J236J715n536n34J049P421O269O84q351R66P775j32G09915
903061G11630O659r340O293j128J698P606J506O179L653K346q861K340k772N033G35572
889527G29513N939Q506N057m433M547j3605M139M331P229K957N04n40M608K897G68740
875898G68434R66m775n657J961J542J1116M811k939l78N399K46L269M469J356G83113
862176G87150N021n75J811m445J2466j986k789L377N207K873J752r010J422O094H18309
$$ y = [621083, 618060, 620111, 619499, 611899, 619943, 620417, 619943, 624790, 619781, 625282, 623993, 626062, 635138, 632625, 629530, 630873, 635234, 634563, 643117, 636812, 642349, 646470, 644377, 646716, 647832, 650148, 652313, 655253, 658432, 651653, 650172, 651491, 653975, 653963, 663207, 665487, 669146, 669476, 665007, 671522, 668900, 672979, 671018, 672758, 671006, 676825, 679452, 680532, 678930, 678720, 683346, 688757, 691684, 692920, 694635, 689099, 688565, 689614, 697035, 703304, 703988, 695637, 696603, 704378, 704246, 709915, 711630, 718289, 708949, 715242, 714114, 715812, 723418, 724924, 731103, 734756, 737102, 728241, 730581, 727809, 732842, 735572, 729513, 735452, 743958, 749015, 744582, 749129, 735524, 739663, 743994, 751223, 754180, 754684, 754144, 758752, 761649, 768740, 768434, 769400, 764625, 758968, 760929, 762471, 773587, 778398, 775459, 775081, 780480, 780726, 783995, 788464, 789820, 783113, 787150, 792171, 791596, 793407, 788962, 801428, 799442, 796653, 800030, 805237, 808110, 809862, 800852, 802274, 808368, 818309]
848353H24517N034M955j1608Q524p516J433l407J140O682J314L768J1361J422H53126
835308H43630j986m68O713L743m763N255K22N76L917Q28J1902K742o869N64Q458H65286
820415H64710L18K669P673N04n117K118M973M625J1128p967j032k801L833J062H91825
806301H92353O257l456k28L06J0528l857K718j32j056M961L6O827l612M212q543I09516
791192I09678O988P337N46n375Q854O36m02l455O539p481R562M068L77j985J4961I51250
775968I49744M667k375L587l059J356L713L485M247J680l305k610J938O107k142I83362
761536I83350M457n64O599k4J5303N279R047K3677L624k532n705n183J74m655A034575
747002A042193J0540J3660J4583K927K670q033o574j962M08m631l246r976k963A045667
$$ y = [824517, 829551, 834506, 822898, 831422, 823906, 825339, 821932, 823072, 829754, 831068, 834836, 846197, 847619, 853126, 843630, 841644, 841176, 847889, 851632, 846869, 852124, 852346, 852922, 856839, 857667, 869569, 872311, 865442, 866006, 874464, 865286, 864710, 865028, 867697, 875370, 875874, 870757, 872875, 877848, 882473, 893601, 885634, 884602, 881801, 885634, 886696, 891825, 892353, 898610, 895154, 894926, 895232, 905760, 901903, 904621, 904489, 903433, 908394, 908430, 915257, 911645, 915857, 907314, 909516, 909678, 916666, 924003, 924549, 919174, 928028, 928664, 928262, 924807, 931346, 923865, 933427, 937495, 937872, 935887, 950848, 951250, 949744, 954411, 952036, 955623, 952564, 953920, 957633, 961118, 965365, 967045, 963740, 961130, 963068, 969175, 967033, 983362, 983350, 987807, 987243, 993842, 993818, 1009121, 1014400, 1023447, 1047124, 1050748, 1048216, 1042511, 1037328, 1037502, 1032847, 1034575, 1042193, 1052733, 1066393, 1080976, 1083903, 1086573, 1078540, 1071966, 1070004, 1070412, 1065781, 1062535, 1052559, 1049596, 1045667]
733282A055733p247R988j092J0288k759J98k496k46n105K556Q302K202K807q008A069788
718544A073471l671Q027n46M175K250k214K639L114j374N303k94O503m505j854A093082
703701A097563l461N908j589J044K129m007P127j002n855P187j920J2730M007A121337
689690A114522j1194o0O161N939K729k633M493M433k46J434J5291j2514J704N22A127335
674641A132602J0666J428n375M607o083N909k34n57J2621j470K718j044k999o96A156928
659486A159609J0199K561q10o72O12l221K867l419Q58J4727n645p846P102l245A168728
644220A170725M260m8l768q10R563M565L785J0222o622n999j2088P14Q04L36j326A178488
627876A181781J212k717Q584P247k928m091m049k472k441O922K142M505L462J2057A199838
$$ y = [1055733, 1048486, 1058474, 1057382, 1067670, 1064911, 1065109, 1062613, 1062367, 1057262, 1059818, 1068120, 1070322, 1073129, 1065121, 1069788, 1073471, 1069800, 1077827, 1077281, 1081456, 1083706, 1081492, 1084131, 1087245, 1085871, 1091174, 1090880, 1097383, 1092878, 1091024, 1093082, 1097563, 1094102, 1100010, 1098421, 1099465, 1101594, 1097587, 1104714, 1103712, 1097857, 1105044, 1103124, 1115854, 1119861, 1121337, 1114522, 1103328, 1103268, 1109429, 1115368, 1118097, 1115464, 1119957, 1124390, 1124144, 1125578, 1140869, 1128355, 1130059, 1130581, 1127335, 1132602, 1143268, 1144696, 1139321, 1143928, 1137845, 1143754, 1143520, 1142963, 1155584, 1154114, 1156832, 1155788, 1152789, 1152093, 1156928, 1159609, 1169808, 1172369, 1171559, 1170887, 1171499, 1168278, 1171145, 1167726, 1168584, 1183311, 1177666, 1169820, 1176922, 1173677, 1168728, 1170725, 1174985, 1174937, 1171169, 1170359, 1179922, 1184487, 1188272, 1198494, 1191872, 1185873, 1173785, 1174499, 1175303, 1175639, 1174313, 1178488, 1181781, 1182993, 1180276, 1188860, 1196107, 1193179, 1189088, 1185039, 1182567, 1180126, 1187048, 1189190, 1193695, 1197157, 1209214, 1199838]
612382A201662j074n04n88O929K471M937J968L563k411Q938M151J062n063r244A218507
596775A226221N375k105j152Q728k789J637j1931m56N303l696R989k856m577m235A237925
581055A231668J4631k237L545o0j2633L059o869M751K526r148M44P750m973n153A226923
565222A216749j302M595J296q998L305J776J0858r119j62j457J314q267k190k105A212214
549272A210798L143R96j3197J2837o754J4913o281l749O125J661l575k424J872A207469
534214A206437m259J4199m259k460k765Q140M187n327q93J0090l600o394J505A200060
519052A216425n435q82O491J014q88j2358O857q285r208R094n938j308k166j2699A184781
502768A186239p031m823J5075j0606N717p097k465j3588J0822j1164M961N58l869A157576
$$ y = [1201662, 1200588, 1200084, 1199496, 1206425, 1208896, 1213833, 1215801, 1219364, 1216953, 1225891, 1230042, 1231104, 1226041, 1216797, 1218507, 1226221, 1231596, 1229491, 1228339, 1237067, 1234278, 1235915, 1223984, 1223528, 1228831, 1225135, 1235124, 1232268, 1227691, 1223456, 1237925, 1231668, 1246299, 1244062, 1247607, 1247547, 1234914, 1237973, 1231104, 1235855, 1238381, 1229233, 1229677, 1237427, 1232454, 1227301, 1226923, 1216749, 1215447, 1220042, 1221338, 1212340, 1215645, 1217421, 1228279, 1219160, 1218998, 1217541, 1218855, 1210588, 1208398, 1206293, 1212214, 1210798, 1213941, 1214937, 1201740, 1214577, 1207823, 1222736, 1216455, 1212706, 1218831, 1220492, 1216917, 1214493, 1216365, 1207469, 1206437, 1202178, 1216377, 1212118, 1209658, 1206893, 1215033, 1219220, 1213893, 1213000, 1223090, 1219490, 1213096, 1214601, 1200060, 1216425, 1210990, 1210108, 1216599, 1217613, 1216725, 1204367, 1211224, 1202939, 1193731, 1202825, 1196887, 1195579, 1193413, 1180714, 1184781, 1186239, 1179208, 1174385, 1189460, 1178854, 1184571, 1177474, 1175009, 1161421, 1172243, 1161079, 1166040, 1166598, 1162729, 1157576]
487389A147492J0390j506j0096P379J655j2489r6k460P073j968o24%k879j518A144258
470870A145446L293n596n058P409O96L467n279O66Q729J625o976m608m907O209A136556
454231A130335J2454j3738R54k226k975P98J457j2009R046j4607j692j0612R586A100970
438520A104066O167j5903j698L977o84m517j5915k160O089j1266J2034m895N585A073459
422699A067898P98p846O623K399j1548m991N615k687K201p912P02K717L30l869A055841
405706A044443K525r96K526k58p325J584n021J422J697J812J386o785l905n873A026224
388584A030327K070j1680J962o00j548j2226q33r185m343M895k045L54m050L54I85714
371334I85630q789p348j740k897M895l426J614m457P564l167J7799J5057J7091A022013
$$ y = [1147492, 1157882, 1156376, 1146280, 1153659, 1155314, 1142825, 1142729, 1140269, 1147342, 1145374, 1144750, 1144750, 1141871, 1140353, 1144258, 1145446, 1148739, 1143143, 1138085, 1145494, 1146190, 1149657, 1144378, 1145044, 1153773, 1155398, 1148422, 1143814, 1138907, 1145116, 1136556, 1130335, 1142789, 1129051, 1130005, 1127779, 1124804, 1125602, 1127059, 1115050, 1124096, 1109489, 1107797, 1097185, 1106771, 1100970, 1104066, 1110233, 1094330, 1092632, 1096609, 1095925, 1091408, 1075493, 1073333, 1079422, 1068156, 1080190, 1075295, 1080880, 1073459, 1067898, 1068696, 1060850, 1067473, 1069872, 1058324, 1053333, 1058948, 1056261, 1058462, 1050550, 1051252, 1053969, 1054299, 1050430, 1055841, 1044443, 1046968, 1045972, 1048498, 1048240, 1040915, 1042499, 1037478, 1038900, 1040597, 1042409, 1043795, 1037010, 1033105, 1027232, 1026224, 1030327, 1032397, 1020717, 1022679, 1022079, 1020531, 1008305, 1007472, 998287, 993944, 998839, 996794, 997148, 993098, 993452, 985714, 985630, 976841, 969493, 967753, 964856, 969751, 966325, 967939, 963482, 971046, 967879, 985678, 1000735, 1017826, 1022013]
355049A009427m187k0504k1500J877k243n261q669l245k549j602l156M50j553I33013
338649I36817l270r262O839n153M739O095k658r30q434j422q446j2778n681l809H84800
321028H82143j962l803j1290O84j062K238p295k730q998j566l503r856o461P295H37739
303276H31008m187j878L456p031M433j493j776m787j0000m422j859l858r6k363G84937
285392G89526K46o425j740l575k459m986J080n867O257m919q500m110o100l870G42897
267373G37947N489p018M469j0624n093o125k460K094R66n603M001n765o551Q94G06777
249218F99447n927n16M751p073m529k963N531n579l798l329j0174K789p492o011F49632
230928F53081q638K093J872K802o575k250k255j1008L395M943O407J3953J3588F97953
$$ y = [1009427, 1005240, 984736, 963236, 965113, 962870, 957609, 948940, 945695, 943146, 941544, 938388, 938838, 937285, 933013, 936817, 933547, 924285, 931124, 925971, 930710, 936805, 934147, 933217, 924783, 923361, 914915, 902137, 896456, 892647, 884800, 882143, 880181, 876378, 865088, 865772, 864710, 866948, 859653, 856923, 847925, 846359, 842856, 833000, 826539, 833834, 837739, 831008, 826821, 824943, 828399, 821368, 825801, 824308, 822532, 817745, 807745, 803323, 801464, 797606, 797510, 795147, 784937, 789526, 789772, 783347, 781607, 778032, 775573, 770587, 771667, 765800, 772057, 767138, 758638, 754528, 748428, 744558, 742897, 737947, 743436, 736418, 740887, 730263, 725170, 719045, 716585, 718679, 719645, 714042, 718043, 712278, 705727, 706621, 706777, 699447, 693520, 693004, 697755, 690682, 686153, 683190, 688721, 683142, 679344, 676015, 665841, 668630, 661138, 655127, 649632, 653081, 644443, 646536, 648408, 651210, 644635, 642385, 640130, 629122, 632517, 637460, 643867, 657820, 671408, 697953]
213655G28031K2808l329k2880j9185j7726j2904j883K4J0624J2243N387L30k3102F51383
196260F26188l1037r415j1581m346p101j383r537l710l893k840j579o771m542E20459
178740E18402k534k987p4o770k779o550o232l905n803J298o611j555k277k804D65355
159917D66652l036o513q81m065r8m860m150K363P22l746o110l501l526n51k815D27243
139759D21649n865K412L098o367m676l930n265Q94p150M04p051J71n828m321p394C72103
119438C70303n081o354q20k987p47l979l55n240J090j947j604k277m175N15o097C27539
98952C29988n582n571K20n179k705p700J652p541l771q141k878J813l735k94B75582
79520B77491q5K032j84q337p455q33j849m664j236B53619
$$ y = [728031, 750839, 747510, 724630, 705445, 687719, 674815, 672932, 672956, 683580, 695823, 701210, 701540, 678438, 651383, 626188, 595151, 585736, 574155, 569809, 562708, 561325, 551788, 548078, 544185, 541345, 539766, 532995, 528453, 520459, 518402, 515868, 512881, 512807, 506037, 503258, 496708, 490476, 486571, 480768, 482066, 475455, 473900, 471623, 468819, 465355, 466652, 463616, 457103, 456222, 452157, 452059, 447199, 443049, 445412, 446134, 442388, 436278, 432777, 429251, 428700, 425885, 427243, 421649, 415784, 418196, 421294, 414927, 410251, 406321, 401056, 401950, 394800, 395204, 388153, 388324, 382496, 378175, 370781, 372103, 370303, 365222, 358868, 358048, 355061, 354314, 350335, 349980, 344740, 345830, 343883, 342279, 340002, 335827, 336342, 330245, 327539, 329988, 324406, 318835, 319055, 313876, 311171, 303471, 305123, 297582, 293811, 285670, 282792, 284605, 280870, 280576, 275582, 277491, 277406, 279438, 279254, 270917, 263462, 262629, 260780, 256116, 254880, 253619]
66073B47607  $$checkpoint
##END=