##TITLE= Raman spectrum of Diopside (no. 5790) � http://rdrs.uaic.ro
##MINERAL= Diopside
##CHEMISTRY= CaMgSi2O6
##JCAMP-DX= 5.01
##DATA TYPE= RAMAN SPECTRUM
##DATA CLASS= XYDATA
##ORIGIN= Department of Geology, UAIC, Romania
##OWNER= http://rdrs.uaic.ro � stud. Apopei Andrei Ionut
##LONGDATE= 2010/09/11 18:38:13.0603 +0300 $$ export date from JSpecView
##SPECTROGRAPHDATASYSTEM= HE 532 (Horiba Jobin-Yvon)
##XUNITS= Raman shift (1/cm)
##YUNITS= Intensity (cnt)
##XFACTOR= 3.188909E-3
##YFACTOR= 2.49278071E-4
##FIRSTX= 3399.61
##FIRSTY= 0.35062266
##LASTX= 210.701
##NPOINTS= 1024
##XYDATA= (X++(Y..Y))
1066073A407P24j868J945j80o50l63j012J361J288K79J033q76n54o62L07j349J97D282
$$ 1407 2131 263 2208 2028 1378 1015 3 1364 2652 2931 3964 3088 2534 1872 2179 830 1027 4282
1051341C540R49k328J162J449n32k9J193k119K55q26R01L59j09K85L56k632r05B762
$$ 3540 4489 2161 3323 4772 4240 4211 5404 3285 3540 2714 3615 3974 3865 4150 4506 1874 969 2762
1036486G02L338R62Q53k711R23j525j850N96L150q09O66l44r19K246m520J848K029B883
$$ 702 4040 5002 5855 3144 4067 2542 692 1288 4438 3629 4295 3951 3032 5278 758 2606 4635 2883
1021509C865j465l50J124R08p13l17k83q58m64J551J983j258P94O12j799M68k017A672
$$ 3865 2400 2050 3174 4082 3369 3052 2769 1911 1447 2998 4981 3723 4517 5129 3330 3798 1781 1672
1006410C181l62O08K587k775k813m37K297K081L88j087j52k564K905j485N30j019D787
$$ 3181 2819 3427 6014 3239 426 -11 2286 4367 4755 3668 3516 952 3857 2372 2902 1883 4787
991988C336j236Q15J751l145M089j418k31j815J101j240J639K107r53j782j7q47B064
$$ 3336 2100 2915 4666 1521 5610 4192 3961 2146 3247 2007 3646 5753 4800 3018 3001 2154 2064
977457C808P36O28k0j424o32j281n98J886K66N17l47k39k794J524Q39J20K171C299
$$ 3808 4544 5172 5152 3728 3096 1815 1217 3103 3369 3886 3539 3300 506 2030 2869 2989 5160 3299
961990C202m21O58j718J557o02M076l194p84K528m059L211r64J15P63j829L30B372
$$ 3202 2781 3439 1721 3278 2676 6752 3558 2774 5302 1243 4454 3490 3605 4368 2539 2869 2372
947224B845j181K416o42J552p87j75k407k84K56L602n00k481K163j113K089l668B370
$$ 2845 1664 4080 3438 4990 4203 4028 1621 1337 1593 5195 4695 2214 4377 3264 5353 1685 2370
932341B264L7J765JJ45K52j07j620P2O47n40Q99n77J762k017J546K49k90j586G04
$$ 2264 2301 4066 4067 4212 4464 4357 2737 2809 3456 2916 3815 3238 5000 2983 4529 4778 4488 2902 704
915664B177J976m36O44P16k56j912Q59j444J614l460O06K729r06k814L593l030C204
$$ 2177 4153 3717 4361 5077 4821 2909 3768 2324 3938 478 1084 3813 2907 93 3686 656 3204
900531D240k563L16Q91M24J71l33J394l70J34j593L49J789m07r11q4q4N64N99C506
$$ 4240 1677 1993 2884 3308 3479 3146 4540 4170 4304 2711 3060 4849 4442 3531 3447 3363 3927 4526 3506
883578A549j669L873m81Q49O33q07R21k319L583k751K934j456j313j133K141j134B646
$$ 1549 -120 3753 3272 4121 4754 3947 4868 2549 6132 3381 6315 4859 3546 2413 4554 3420 2646
868190E326k142L003k971J815k612J671j065Q06j66K029q87r23n63j932j356L862C222
$$ 5326 3184 6187 3216 5031 2419 4090 3025 3831 3665 5694 4807 3884 3321 1389 33 3895 3222
852683D133j34k258J557K816k151n32j936M002k656o05K777l702K201l1L28L962A692
$$ 4133 3999 1741 3298 6114 3963 3431 1495 5497 2841 2236 5013 1311 3512 3481 3809 7771 1692
837051C135J802n02l165J152J729L6j404k53J907k737M029j658P16l63j767m37C115
$$ 3135 4937 4435 1270 2422 4151 4187 2783 2530 4437 1700 5729 4071 4787 4424 2657 2220 3115
821297E665k777O77O5M97j412r44M238l213L446k782l35j127o24m08K938K110C912
$$ 5665 2888 3565 3630 4127 2715 1771 6009 2796 6242 3460 3125 1998 1374 966 3904 6014 3912
805413E661l974Q48n56J423n57r0J62L77P73k36m17o69Q7R86j247n9J2N16Q39B701
$$ 5661 1687 2535 1979 3402 2845 2755 2917 3294 4067 3831 3414 2745 2832 3818 2571 2512 2524 3040 3879 2701
786727D439p82r27j540J880L31j865N82P61J804j39j256m65R03j150O49j474J080C550
$$ 4439 3657 2730 1190 3070 3401 1536 2118 2879 4683 4544 3288 2823 3726 2576 3225 1751 2831 3550
769668C118K949k665O81j550k235J579j193J291m38K692k238m40J180P83n50j881C196
$$ 3118 6067 3402 4083 2533 298 1877 684 1975 1537 4229 1991 1551 2731 3514 2964 1083 3196
753374B141J752j668Q15J030k102j526J893N96K503r17j241J530q47N21M12k36D599
$$ 2141 3893 2225 3040 4070 1968 442 2335 2931 5434 4517 3276 4806 3959 4480 4892 4656 4599
736948D506J454n98J3J920n999L790N15J486m201K349q55J267j360J87k764M793C845
$$ 4506 5960 5362 5375 7295 1296 5086 5601 7087 2886 5235 4380 5647 4287 4474 1710 6503 3845
720394C850L963j615q96j545K090m66O49l22m68m32j440M066k664O10k738R69D687
$$ 3850 7813 6198 5302 3757 5847 5381 6030 5708 5240 4808 3368 7434 4770 5380 2642 3611 4687
703701D720l675M314k848J686n82R29Q21R65k455K115k671J862n49p29O74j198B360
$$ 4720 1045 5359 2511 4197 3615 4544 5365 6330 3875 5990 3319 5181 4632 3903 4577 3379 2360
686878D364j811J356l323L262K759K38l288N61K793l38l39m514K396p72L187r16G614
$$ 4364 2553 3909 586 3848 6607 6845 3557 4118 6911 6573 6234 1720 4116 3344 6531 5615 7614
669919CN274r54J098J350N4j602R89l07M13M85n60J384q83r92N56j496Q43J023I032
$$ 3 5277 4323 5421 6771 6825 5223 6212 5905 6318 6803 6243 7627 6744 5752 6308 4812 5655 6678 9032
650912D693J166J311j173L03J994m665L182J4k397L325k721j353P34M117m54l189D901
$$ 4693 5859 7170 5997 6300 8294 3629 6811 6825 4428 7753 5032 3679 4413 8530 8076 4887 4901
633659F391j066L74j101M801j102j857j209M82k576K858K354k216o69J995k540F014
$$ 6391 5325 5699 4598 9399 8297 6440 5231 5713 3137 5995 8349 6133 5464 7459 4919 6014
617236F354N92n707N127q11K608j638L05j638J7q45R54Q10P75j384O066j276m623F319
$$ 6354 6946 1239 6366 5555 8163 6525 6830 5192 5209 4364 5318 6128 6903 5519 11585 10309 5686 6319
598735G239K109j814K686m729L694R6j740N64m43j738K05j54K294R99r08K188D134
$$ 7239 9348 7534 10220 5491 9185 9281 7541 8105 7662 5924 6129 5975 8269 9268 8360 10548 4134
581055G187K729J506k056j13n43l530J545l62J834K267j871P93n03L997m927j544E694
$$ 7187 9916 11422 9366 9253 8710 5180 6725 6363 8197 10464 8593 9386 8883 12880 7953 6409 5694
563233E879k82m97M182J17j611M42j105j392L01j210n26K319Q79J97j061n3l508E432
$$ 5879 5597 5100 9282 9399 7788 8230 7125 5733 6034 4824 4298 6617 7496 7693 6632 6579 3071 5432
544265G541K110J607l214L445m041K800m290K657k633J904J401l061j800K772A0006
$$ 7541 9651 11258 8044 11489 7448 10248 5958 8615 5982 7886 9287 6226 4426 7198 10006
528162G202K019J625k369P99K204l013k364M223l82J238k575j926N957p00j706A3601
$$ 7202 9221 10846 8477 9276 11480 8467 6103 10326 9944 11182 8607 6681 12638 11938 10232 13601
510924A1682k746k745qN032n45j768o86l709K916q98K738P60k081J879l699j033G404
$$ 11682 8936 6191 6183 11215 10670 8902 8216 4507 7423 6525 9263 10023 7942 9821 6122 5089 7404
492526E186J850J384l545J423j239K542j344j738L014j447J182n403K229O47K772F579
$$ 5186 7036 8420 4875 6298 5059 7601 6257 4519 7533 6086 7268 1865 4094 4741 7513 6579
475012C596L676j505k726M797j896k110l835N055J494k31K973k244J933k924J01A685
$$ 3596 7272 5767 3041 7838 5942 3832 -3 5052 6546 6315 9288 7044 8977 6053 6154 1685
457360F756kj260o47J659o07l485L571O58j968R86Q07r55N22J316l361J536J249H854
$$ 6756 6754 5494 4847 6506 5899 2414 5985 6643 4675 5661 6468 5513 6035 7351 3990 5526 6775 8854
437469D241P50K85J834K088n865L639k982K275J737k077r5Q06l295Q81j348L872F445
$$ 4241 4991 5276 7110 9198 3333 6972 3990 6265 8002 5925 5830 6636 3341 4222 2874 6746 6445
418463D850K43K475l461J327J689n219r71l94L100J733j288j466J91J955l692E658
$$ 4850 5093 7568 4107 5434 7123 1904 933 539 3639 5372 4084 2618 2809 4764 1072 5658
400369C912j924J712L442j380R25j592j267N70J975k558l61N41l993N294J012C579
$$ 3912 1988 3700 7142 5762 6687 5095 3828 4398 6373 3815 3454 3995 2 5296 6308 3579
382131G006k438o01J128m377J094K212j854K862m082K073L406l539j954J862J252E266
$$ 7006 4568 3967 5095 718 1812 4024 2170 5032 950 3023 6429 2890 936 2798 4050 5266
363748C425J399j263J42L58L383J333L62L565j795k83L785m888K239m96j106L177A2520
$$ 3425 4824 3561 3703 4061 7444 8777 9139 12704 10909 10626 14411 9523 11762 11266 10160 13337 12520
344127A0372L719k722L181J850m89N018k863R16M840J1211J4342K2224M1588N7351B00861
$$ 10372 14091 11369 14550 16400 15911 20929 18066 18982 23822 35033 49375 71599 113187 170538 200861
326547A80762l4999l4423m515J9024N3573J50820K92656K84019N2098k48313l07695B10047
$$ 180762 145763 111340 106825 125849 179422 330242 622898 906917 959015 710702 403007 210047
312169A25201m4069k5210j3766q224l113m914o390L975j316q551j570L73l479A2017
$$ 125201 81132 55922 42156 33932 30819 25905 19515 23490 22174 13623 12053 12426 8947 12017
295468A0588L140m671N11K922k155L782l633J297j404l350L416K190r79k600J393I967
$$ 10588 13728 9057 9568 12490 10335 14117 10484 11781 10377 7027 10443 12633 11654 9054 10447 9967
276399A6575q44O388L327J0739K3657L6575L7652Q390l5196m5457l3222j1487A1833
$$ 16575 15731 22119 25446 36185 59842 96417 134069 142459 107263 61806 28584 17097 11833
260581A2325k929O66j964K279J89n357J838j440L954j700l683K144R88j714j072G300
$$ 12325 9396 10062 8098 10377 10566 5209 7047 5607 9561 7861 4178 6322 7310 5596 4524 7300
241234H560l746L123k136q81K66J90n286j80J471J249R93Q79r8K057L634J901A2704
$$ 8560 4814 7937 5801 4920 5186 5376 90 -90 1381 2630 3623 4502 4404 6461 10095 11996 12704
220579A7833O023J1091J3460J6478K9895O0697J28027K14829K98824K02723k2761G31102
$$ 17833 23856 34947 48407 64885 94780 155477 283504 498333 797157 999880 977119 731102
205552D53443j97733j05064n5838k7701j8063j0550p930q010p442m428J178l868E124
$$ 453443 255710 150646 94808 67107 49044 38494 30564 22554 15112 10684 11862 7994 5124
189267D009k96J026Q37R36J35n59O162O45j452L397O625J756P39o939J257J174B2306
$$ 4009 3713 4739 5576 6512 6647 6088 12250 12895 11443 14840 21465 23221 23960 17021 18278 19452 22306
168169A7879Q842o35K53n265M405P776P439N663q889j3400j0894j0295K612j36D557
$$ 17879 26721 26086 26339 21074 25479 33255 40694 46357 37468 24068 13174 2879 5491 5355 4557
149265D826p89l71J955j407m85O014p67n424K551o103L960r15K237N532k7L485B1231
$$ 4826 4037 3666 5621 4214 3729 9743 8976 3552 6103 0 3960 3045 5282 10814 10787 14272 21231
127826C0045K9131N4344Q8301P0037L1978l9660o8435o2117l1401k663K2656K2133A54334
$$ 30045 59176 113520 201821 271858 303836 264176 195741 133624 102223 99560 122216 144349 154334
111023A40294k7374k4983k2160J3091K0016M3355N1898K8953j2889l1768m6224A00110
$$ 140294 112920 87937 65777 78868 98884 142239 194137 223090 210201 178433 132209 100110
95320H5408N826m165j308k735m016n660j0326L76n622n502J385K044O301M12F6942
$$ 85408 91234 87069 85761 83026 79010 73350 63024 63400 57778 52276 53661 55705 62006 62418 66942
75859F0320M654n916R605j38j604o490E4095
$$ 60320 64974 59058 68663 68525 66921 60431 54095
66073D9603  $$checkpoint
##END=