##TITLE= Raman spectrum of Diopside (no. 5791) � http://rdrs.uaic.ro
##MINERAL= Diopside
##CHEMISTRY= CaMgSi2O6
##JCAMP-DX= 5.01
##DATA TYPE= RAMAN SPECTRUM
##DATA CLASS= XYDATA
##ORIGIN= Department of Geology, UAIC, Romania
##OWNER= http://rdrs.uaic.ro � stud. Apopei Andrei Ionut
##LONGDATE= 2010/09/11 18:37:14.0383 +0300 $$ export date from JSpecView
##SPECTROGRAPHDATASYSTEM= HE 532 (Horiba Jobin-Yvon)
##XUNITS= Raman shift (1/cm)
##YUNITS= Intensity (cnt)
##XFACTOR= 3.188909E-3
##YFACTOR= 8.98851423E-4
##FIRSTX= 3399.61
##FIRSTY= -5.17584971
##LASTX= 210.701
##NPOINTS= 1024
##XYDATA= (X++(Y..Y))
1066073e758k092%%%%%%%%%%%%%%%%%%%%%%%%%%%%%%%%%%%%%%%%%%%%%%%%%%%%g850
$$ -5758 -7850 -7850 -7850 -7850 -7850 -7850 -7850 -7850 -7850 -7850 -7850 -7850 -7850 -7850 -7850 -7850 -7850 -7850 -7850 -7850 -7850 -7850 -7850 -7850 -7850 -7850 -7850 -7850 -7850 -7850 -7850 -7850 -7850 -7850 -7850 -7850 -7850 -7850 -7850 -7850 -7850 -7850 -7850 -7850 -7850 -7850 -7850 -7850 -7850 -7850 -7850 -7850 -7850 -7850
1023090g850%%%%%%%%%%%%%%%%%%%%%%%%%%%%%%%%%%%%%%%%%%%%%%%%%%%%%%%%g850
$$ -7850 -7850 -7850 -7850 -7850 -7850 -7850 -7850 -7850 -7850 -7850 -7850 -7850 -7850 -7850 -7850 -7850 -7850 -7850 -7850 -7850 -7850 -7850 -7850 -7850 -7850 -7850 -7850 -7850 -7850 -7850 -7850 -7850 -7850 -7850 -7850 -7850 -7850 -7850 -7850 -7850 -7850 -7850 -7850 -7850 -7850 -7850 -7850 -7850 -7850 -7850 -7850 -7850 -7850 -7850 -7850 -7850 -7850
976644g850%%%%%%%%%%%%%%%%%%%%%%%%%%%%%%%%%%%%%%%%%%%%%%%%%%%%%%%%g850
$$ -7850 -7850 -7850 -7850 -7850 -7850 -7850 -7850 -7850 -7850 -7850 -7850 -7850 -7850 -7850 -7850 -7850 -7850 -7850 -7850 -7850 -7850 -7850 -7850 -7850 -7850 -7850 -7850 -7850 -7850 -7850 -7850 -7850 -7850 -7850 -7850 -7850 -7850 -7850 -7850 -7850 -7850 -7850 -7850 -7850 -7850 -7850 -7850 -7850 -7850 -7850 -7850 -7850 -7850 -7850 -7850 -7850 -7850
929017g850%%%%%%%%%%%%%%%%%%%%%%%%%%%%%%%%%%%%%%%%%%%%%%%%%%%%%%%%g850
$$ -7850 -7850 -7850 -7850 -7850 -7850 -7850 -7850 -7850 -7850 -7850 -7850 -7850 -7850 -7850 -7850 -7850 -7850 -7850 -7850 -7850 -7850 -7850 -7850 -7850 -7850 -7850 -7850 -7850 -7850 -7850 -7850 -7850 -7850 -7850 -7850 -7850 -7850 -7850 -7850 -7850 -7850 -7850 -7850 -7850 -7850 -7850 -7850 -7850 -7850 -7850 -7850 -7850 -7850 -7850 -7850 -7850 -7850
880169g850%%%%%%%%%%%%%%%%%%%%%%%%%%%%%%%%%%%%%%%%%%%%%%%%%%%%%%%%g850
$$ -7850 -7850 -7850 -7850 -7850 -7850 -7850 -7850 -7850 -7850 -7850 -7850 -7850 -7850 -7850 -7850 -7850 -7850 -7850 -7850 -7850 -7850 -7850 -7850 -7850 -7850 -7850 -7850 -7850 -7850 -7850 -7850 -7850 -7850 -7850 -7850 -7850 -7850 -7850 -7850 -7850 -7850 -7850 -7850 -7850 -7850 -7850 -7850 -7850 -7850 -7850 -7850 -7850 -7850 -7850 -7850 -7850 -7850
830064g850%%%%%%%%%%%%%%%%%%%%%%%%%%%%%%%%%%%%%%%%%%%%%%%%%%%%%%%%g850
$$ -7850 -7850 -7850 -7850 -7850 -7850 -7850 -7850 -7850 -7850 -7850 -7850 -7850 -7850 -7850 -7850 -7850 -7850 -7850 -7850 -7850 -7850 -7850 -7850 -7850 -7850 -7850 -7850 -7850 -7850 -7850 -7850 -7850 -7850 -7850 -7850 -7850 -7850 -7850 -7850 -7850 -7850 -7850 -7850 -7850 -7850 -7850 -7850 -7850 -7850 -7850 -7850 -7850 -7850 -7850 -7850 -7850 -7850
778664g850%%%%%%%%%%%%%%%%%%%%%%%%%%%%%%%%%%%%%%%%%%%%%%%%%%%%%%%%g850
$$ -7850 -7850 -7850 -7850 -7850 -7850 -7850 -7850 -7850 -7850 -7850 -7850 -7850 -7850 -7850 -7850 -7850 -7850 -7850 -7850 -7850 -7850 -7850 -7850 -7850 -7850 -7850 -7850 -7850 -7850 -7850 -7850 -7850 -7850 -7850 -7850 -7850 -7850 -7850 -7850 -7850 -7850 -7850 -7850 -7850 -7850 -7850 -7850 -7850 -7850 -7850 -7850 -7850 -7850 -7850 -7850 -7850 -7850
725925g850%%%%%%%%%%M2L3L3L3L3L3L3L3L4L3L3L3L3L3L4L3L3L3L4L3L3L3L4g045
$$ -7850 -7850 -7850 -7850 -7850 -7850 -7850 -7850 -7850 -7850 -7850 -7808 -7775 -7742 -7709 -7676 -7643 -7610 -7577 -7543 -7510 -7477 -7444 -7411 -7378 -7344 -7311 -7278 -7245 -7211 -7178 -7145 -7112 -7078 -7045
693438g012L4L3L3L4L3L4L3L4L3L4L3L4L3L4L3L4L4L3L4L3L4L4L3L4L4L4L3L4f038
$$ -7012 -6978 -6945 -6912 -6878 -6845 -6811 -6778 -6744 -6711 -6677 -6644 -6610 -6577 -6543 -6510 -6476 -6442 -6409 -6375 -6342 -6308 -6274 -6241 -6207 -6173 -6139 -6106 -6072 -6038
665180f004L4L3L4L4L4L4L4L4L4L4L3L4L4L4L5L4L4L4L4L4L4L4L4L4L5L4L4L4e017
$$ -6004 -5970 -5937 -5903 -5869 -5835 -5801 -5767 -5733 -5699 -5665 -5632 -5598 -5564 -5530 -5495 -5461 -5427 -5393 -5359 -5325 -5291 -5257 -5223 -5189 -5154 -5120 -5086 -5052 -5017
636544d983L4L4L5L4L4L5L4L4L5L4L5L4L4L5L4L5L4L5L5L4L5L4L5L5L4L5L4L5c983
$$ -4983 -4949 -4915 -4880 -4846 -4812 -4777 -4743 -4709 -4674 -4640 -4605 -4571 -4537 -4502 -4468 -4433 -4399 -4364 -4329 -4295 -4260 -4226 -4191 -4156 -4122 -4087 -4053 -4018 -3983
607518c948L4L5L5L5L4L5L5L5M%%%%J8K2K2K1K2K2K1K2K2K2K1K2K2K2K1K2K2K2c256
$$ -3948 -3914 -3879 -3844 -3809 -3775 -3740 -3705 -3670 -3666 -3666 -3666 -3666 -3666 -3648 -3626 -3604 -3583 -3561 -3539 -3518 -3496 -3474 -3452 -3431 -3409 -3387 -3365 -3344 -3322 -3300 -3278 -3256
575131c234K1K2K2K2K2K2K2K2K2K2K2K1K2K2K2K2K2K2K2K3K2K2K2K2K2K2K2K2b597
$$ -3234 -3213 -3191 -3169 -3147 -3125 -3103 -3081 -3059 -3037 -3015 -2993 -2972 -2950 -2928 -2906 -2884 -2862 -2840 -2818 -2795 -2773 -2751 -2729 -2707 -2685 -2663 -2641 -2619 -2597
545268b575K3K2K2K2K2K3K2K2K2K2K3K2K2K3K2K2K2K3K2K2K3K2K3K2K2K3K2K3a928
$$ -2575 -2552 -2530 -2508 -2486 -2464 -2441 -2419 -2397 -2375 -2353 -2330 -2308 -2286 -2263 -2241 -2219 -2197 -2174 -2152 -2130 -2107 -2085 -2062 -2040 -2018 -1995 -1973 -1950 -1928
514991a906K3K2K3K2K3K2K3K2K3K3K2K3K2K3K2O3N4N3N4N4N3N4N4N4N4N3N4N4h06
$$ -1906 -1883 -1861 -1838 -1816 -1793 -1771 -1748 -1726 -1703 -1680 -1658 -1635 -1613 -1590 -1568 -1505 -1451 -1398 -1344 -1290 -1237 -1183 -1129 -1075 -1021 -968 -914 -860 -806
484300g52N4N4N4N4N4N4N4N4N5N4N4N4N4N5N4N4N5N4N5N4N4N5N4N5N5N4N5N4N5H78
$$ -752 -698 -644 -590 -536 -482 -428 -374 -320 -265 -211 -157 -103 -49 6 60 114 169 223 278 332 386 441 495 550 605 659 714 768 823 878
452142I32N5N5N5N5N4N5N5N5N5N5N5N5N5N5N5N5N5N6N5N5N5N5N6N5N5N6N5N6N5B586
$$ 932 987 1042 1097 1152 1206 1261 1316 1371 1426 1481 1536 1591 1646 1701 1756 1811 1866 1922 1977 2032 2087 2142 2198 2253 2308 2364 2419 2475 2530 2586
419523B610%%%%%%%%%%%%%%%%%%%%%%%%%%%%%%%%%%%%%%%%%%%%%%%%%%%%%%%%B610
$$ 2610 2610 2610 2610 2610 2610 2610 2610 2610 2610 2610 2610 2610 2610 2610 2610 2610 2610 2610 2610 2610 2610 2610 2610 2610 2610 2610 2610 2610 2610 2610 2610 2610 2610 2610 2610 2610 2610 2610 2610 2610 2610 2610 2610 2610 2610 2610 2610 2610 2610 2610 2610 2610 2610 2610 2610 2610 2610
357226B610%%%%%%%%%%%%%%%O26J940k896J560J559J561L078M883J953K3350J3802F6749
$$ 2610 2610 2610 2610 2610 2610 2610 2610 2610 2610 2610 2610 2610 2610 2610 2610 3236 5176 2280 3840 5399 6960 10038 14921 16874 40224 54026 66749
326547F1625r230Q246R570L0131Q7150J83685L09281K85982K5710k52838l22242B09866
$$ 61625 52395 60641 70211 100342 187492 371177 680458 966440 992150 739312 417070 209866
312169A15765n2302k7754j4682j0053k836j247j04J112K120l339o413M618K896D059
$$ 115765 63463 35709 21027 10974 8138 6891 6787 7899 10019 6680 267 4885 7781 4059
295468E619J185l256l262P351Q685n297n21N525N536O347j2476j5067K20J293F492
$$ 5619 6804 3548 286 7637 16322 11025 10504 16029 21565 27912 15436 369 589 1882 6492
277525G695l527K581L102N656O284N660Q989Q281R086m445k0305j4324q053l065A248
$$ 7695 4168 6749 9851 15507 21791 27451 36440 44721 53807 49362 29057 14733 6680 3615 1248
259447e00O101j900k380N341m294l017K836K434J144o763R63M886o794J05N279A005
$$ -500 5601 3701 1321 6662 2368 -649 2187 4621 5765 -998 -35 4851 -1943 -1838 3441 1005
240091c368j027K923k057j28O915k535j304O984m32j673j216m187N307O857l825F297
$$ -3368 -4395 -1472 -3529 -3657 3258 723 -581 6403 5971 4298 3082 -1105 4202 11059 7234 6297
220579A0616k8q85q04M791K1981M1603P6650J21601J40599J03080j1272j28494B31760
$$ 10616 10588 9703 8899 13690 35671 77274 153924 275525 416124 519204 507932 379438 231760
204393A22426p5037l4651n444k343j609J601J888N99k837j787K028m73l455j227C165
$$ 122426 47389 12738 7294 4951 3342 4943 6831 7430 4593 2806 4834 4361 906 -321 3165
185763F340k693j384J091j951J311M965M018L157m01j631k808o675j160N299J290A2966
$$ 6340 3647 2263 3354 1403 2714 7679 11697 14854 14453 12822 10014 3339 2179 7478 8768 12966
165815B3011l503j1435k010m031k813N508L40p9J66l296K042o42k659J044k109a51
$$ 23011 19508 8073 6063 2032 -781 4727 5067 4988 5154 1858 3900 3258 599 1643 -466 -151
145705D95j381J482k110p90K890K67J307J898J067j842j051L008r52J0292K6809G7770
$$ 495 -886 596 -1514 -2304 586 853 2160 4058 5125 3283 2232 5240 4288 14580 41389 77770
125432A59373J25454J08792M6955m2686j08253j04775o8421l0221n249k589l821F3437
$$ 159373 284827 393619 440574 397888 289635 184860 116439 86218 80969 78380 74559 63437
109818D1316j7808r110J6916O9188J02806J05466O4534k5559q6288r1506p3585E8414
$$ 41316 23508 14398 31314 100502 203308 308774 373308 347749 261461 169955 96370 58414
94108D1197j1539l319r926r063q43n247r18L205o50l57l51L412N048J552M39A1994
$$ 41197 29658 26339 16413 7350 6507 1260 342 3547 2897 2540 2189 5601 10649 12201 12640 11994
73416A7951J0595M04p828q839E106
$$ 17951 28546 28950 21122 12283 5106
66073A533  $$checkpoint
##END=