##TITLE= Raman spectrum of Dolomite � http://rdrs.uaic.ro
##MINERAL= Aragonite
##CHEMISTRY= CaMg(CO3)2
##JCAMP-DX= 5.01
##DATA TYPE= RAMAN SPECTRUM
##DATA CLASS= XYDATA
##ORIGIN= Department of Geology, UAIC, Romania
##OWNER= http://rdrs.uaic.ro � stud. Apopei Andrei Ionut
##LONGDATE= 2009/10/18 22:37:23.0776 +0300 $$ export date from JSpecView
##XUNITS= Raman shift (1/cm)
##YUNITS= Intensity (cnt)
##XFACTOR= 3.188736E-3
##YFACTOR= 2.49185798E-3
##FIRSTX= 3399.97
##FIRSTY= 19.17468674
##LASTX= 211.234
##NPOINTS= 1024
##XYDATA= (X++(Y..Y))
1066244G695%%O833m980%%N561%k348j913j914j914K528%%%L707%%J2009K56j3372A3722
1047613B1945p79j4774N848k279o849j606K205J3502j235j3456p346O225j4p38D536
1035084D536%%%J395j436M1n404L164j255n249K717M650K433K435O989r337r542C156
1020094A7500j3308p570P492N703K374j1701%%J829%%%%j829j746j456M51k214c660
1004182f447M895J723O0L827p786k049M504L031J954K814l856L387l40n274P367I646
990546D225l540N787K792k472m783k394j332L127J065J367N42M76k357L141M01G272
976813F113l954k611R62J533m07k343l100J396L485J5J096J592K597J245K167H638
962977H411k316j144j684L103J897j859l669k358L53P01j974j037L951M542j008E568
$$ plain form
1066244 7695 7695 7695 14528 9548 9548 9548 15109 15109 12761 10848 8934 7020 9548 9548 9548 9548 13255 13255 13255 25264 25520 12148 13722
1047613 21945 21166 6392 12240 9961 3112 1506 3711 17213 15978 2522 -4824 1401 1387 649 4536
1035084 4536 4536 4536 4536 5931 4495 4536 -868 2296 1041 -4208 -1491 3159 5592 8027 15016 5679 -3863 3156
1020094 17500 4192 -3378 4114 9817 12191 490 490 490 2319 2319 2319 2319 2319 490 -1256 -2712 -2261 -4475 -3660
1004182 -6447 -1552 171 231 4058 -3728 -5777 -1273 1758 3712 6526 2670 6057 5717 443 7810 9646
990546 4225 685 6472 9264 6792 2009 -385 -1717 1410 2475 3842 4384 4860 2503 5644 6045 7272
976813 6113 2159 -452 510 2043 1636 -707 -3807 -2411 1074 1089 2185 3777 6374 7619 9786 8638
962977 8411 6095 4951 3267 6370 8267 6408 2739 381 734 1435 -539 -1576 2375 6917 5909 5568
949037I408J896k156l678k771k326R48J3j271Q9n77K739R29j237j448k04K24J440C747
933335C298r25j567J044r87K28j157P9P6J569j500M93n57M84k73M39m32j290J31a205
916670c41N05N93n16K88j188n86L46q99oQ2j826N68J468R31k343k66q19R4N64b226
899011b018p62J79O91k20L35j23k02J235l51R75j165P6L33O40n42M78p09l44M36a405
881189A0P03j19j009J318j787O3J465R54p21j735r21q8J65M26J737PM52j251m18e99
863204d71R78j520R67P94n90p2N4m76J483Q78j111o04J54Q65j512l47r88N26M63b289
845050a864J16p01R58j152K7K86m89K79Q89kp88l31l98M10j570j241L79oL63K37b865
825851a763j261L83Lj448J688q17k027o25J164L38J189L87P8O55M37p92k252J230c652
$$ plain form
949037 9408 11304 9148 5470 2699 373 1321 1334 63 152 -425 2314 3243 2006 558 354 578 2018 3747
933335 3298 2373 806 1850 863 1091 -66 13 89 1658 158 651 94 578 305 744 312 -978 -847 -1205
916670 -341 164 757 241 529 -659 -1245 -899 -1798 -1804 -1722 -3548 -2980 -1512 -581 -2924 -3190 -4009 -3915 -3351 -2226
899011 -2018 -2780 -2601 -1910 -2130 -1795 -1918 -2120 -885 -1236 -261 -1426 -1350 -1017 -377 -919 -441 -1150 -1494 -1058 -1405
881189 10 713 594 -415 903 -884 -821 644 1598 877 -858 -1779 -1867 -1702 -1276 461 468 920 -331 -749 -599
863204 -471 507 -1013 -46 748 158 86 140 -336 1147 2025 914 310 464 1329 -183 -530 -1518 -992 -529 -2289
845050 -1864 -1748 -2449 -1491 -2643 -2616 -2330 -2819 -2540 -1651 -1653 -2441 -2772 -3170 -2760 -4330 -5571 -5192 -5198 -4835 -4598 -2865
825851 -1763 -3024 -2641 -2638 -4086 -2398 -3215 -5242 -5867 -4703 -4365 -3176 -2789 -2711 -2056 -1619 -2411 -4663 -3433 -3652
808239d791Q25J551J64j145O17J96J50j589o38J587k87O56j482r84n76K76j928h014
791357e059P51K82o05j444J246j733J733M85j485O12j230j83K6J44J048q17j78f290
774338g971J057Q88p19K25Q51l46R1J042j144O88K8R71n4P73n15j168O39j383d191
756265e157P70R27j055k87j58J562Q98q9J143J130l435r57o38J987j79J228j75h67
738948a211m81j907m3M51j33k18P68q84m91k92k29N53J116P84J53Q41R94J027D05
720561D29q23M62M96J065m90M59K19p17j03k375K506K819J862M46k815L81r39D037
702940E283Kr06j9j993M57K49m406j291M90J137n23O74K396k540L91k825o48L218D216
684227B306m347o374N084J844O446p16n06n979l048K974M162k202J100l857l520a601
$$ plain form
808239 -4791 -3966 -2415 -2251 -3396 -2779 -2583 -2433 -4022 -4660 -3073 -3360 -2704 -4186 -5170 -5746 -5470 -7398 -8014
791357 -5059 -4308 -4026 -4631 -6075 -4829 -6562 -4829 -4344 -5829 -5217 -6447 -6630 -6604 -6460 -5412 -6229 -6407 -6290
774338 -7971 -6914 -6026 -6745 -6520 -5669 -6015 -5924 -4882 -6026 -5338 -5310 -4339 -4393 -3620 -4135 -5303 -4664 -6047 -4191
756265 -5157 -4387 -3460 -4515 -4802 -4960 -3398 -2500 -2589 -1446 -316 -3751 -4708 -5346 -3359 -3538 -2310 -2485 -867
738948 -1211 -1692 -3599 -3642 -3191 -3324 -3542 -2774 -3658 -4149 -4441 -4670 -4117 -3001 -2217 -2064 -1223 -229 798 405
720561 429 -394 68 564 1629 1139 1598 1817 1100 997 -1378 1128 3947 5809 6255 3440 3821 2882 4037
702940 5283 5285 4379 4360 2367 2824 3073 -1333 -2624 -2134 -997 -1520 -846 1550 -990 -599 -3424 -4072 -854 4216
684227 2306 -2041 -8415 -3331 -1487 4959 4243 3737 -2242 -5290 -2316 1846 -356 744 -3113 -6633 -1601
668193f9O58k123J91K352P7K674o743k591p67q63O72K89K90K90K89K90K90K91G154
649169B707o051l80o414J1077L047j1397N034m364K598l666m992J3579O386j1088c90
633828b100l145R99o805J047J9059Q2j0540k23J2001j3152q28J271J398l489j380i339
617405h557J3419O986m135j5947j207P628J2247O690j4026j0097M767J2270O27d312
602809a44Q000R522l813k0437R541P351%m809J153m842J403k365J4544q253o819g823
586148C279K313j4974P819n36m165O158Q969p269j35r720%%J4514J572j1008m718B470
568366b211M066L074j183K726M300m535n358%l040o16P313%%j2756J5915M427B707
550441B707%r140%R204j688j740Q071m02j2105J5997j3614l752J3353M469n707b172
$$ plain form
668193 -69 589 -1534 -1343 1009 1086 3760 -2983 -5574 -6341 -7204 -6532 -6243 -5953 -5663 -5374 -5084 -4794 -4503 7154
649169 2707 -3344 -3724 -10138 939 3986 -7411 -2377 -6741 -4143 -7809 -12801 778 7164 -3924 -390
633828 -2100 -5245 -4246 -11051 -10004 9055 9137 -1403 -1626 10375 -2777 -3605 -2334 -936 -4425 -5805 -9339
617405 -8557 4862 11848 7713 -8234 -9441 -1813 10434 17124 3098 -6999 -2232 10038 10665 -4312
602809 -144 7856 17378 13565 -6872 2669 10020 10020 5211 6364 1522 2925 560 15104 6851 32 -7823
586148 3279 5592 -9382 -1563 -2099 -6264 -106 8863 1594 1459 -8261 -8261 -8261 6253 7825 -3183 -7901 2470
568366 -2211 1855 4929 3746 6472 10772 6237 879 879 -2161 -2777 4536 4536 4536 -8220 7695 12122 2707
550441 2707 2707 -6433 -6433 2771 1083 -657 7414 7012 -5093 10904 -2710 -6462 6891 11360 5653 -2172
533374a5296J8004o796p57P486N215k811l765M608k551p856J2870L05K130n288H037
517192I833r584j036l433K512Q062j2020j3564K6899j0413O799q307o361N301g975
501914a2830m351P626Q249K243q783p144J635L004J2397K708r938N423j4931J1494D881
485500a0897P89J8161n477r22K51j4827J5776Q383j2420K665r49M077Q265n253A396
468966A270N279j112K36O846o051j823l52j054m695K682R49n914O452l163p2k260E537
450219a448j569r55r55J759%K587q115P193Q828p918J79N953j0061L307O102k009d528
431318e41m41l18M812m790K870k897J656l00m45l111K693J259K654m632L152k399A1421
412261I773k847o443m335N172L923o78k610l49N651k298j0143R540j843O978L898A144
$$ plain form
533374 -15296 2708 -4088 -4845 2641 7856 5045 1280 5888 3337 -4519 8351 8656 10786 5498 8037
517192 9833 249 -787 -4220 -1708 6354 -5666 -19230 7669 -2744 4055 -4252 -10613 -5312 -7975
501914 -12830 -17181 -9555 -1306 937 -7846 -14990 -13355 -10351 2046 4754 -5184 239 -14692 -3198 4881
485500 -10897 -10108 8053 2576 1654 1905 -12922 2854 11237 -1183 1482 533 4610 12875 7622 1396
468966 1270 6549 5437 5673 12519 6468 4645 4293 3239 -1456 1226 2175 -3739 2713 -450 -522 -2782 5537
450219 -1448 -3017 -3972 -4927 -3168 -3168 -581 -8696 -1503 7325 -593 -414 5539 -4522 -1215 4887 2878 -4528
431318 -541 -982 -1300 3512 -1278 1592 -1305 351 51 -394 -3505 -812 447 3101 -1531 1621 -778 11421
412261 9773 6926 483 -3852 1320 5243 4565 1955 1606 7257 4959 -5184 4356 2513 9491 13389 1144
394115c650O243q88M707n415J056j134o41P536j842l306K108n596m973R849n595a154
375826G888L259l837p65O236k709m913J979p44Q430p450L042r389k099j108M431A558
357396g26J0375J535r140j670L433Q56O662j2181j982K693J0193M2549K48756G55527
341010I80770k56715m77670k00968l5226q589p505J478L827N826m465m452Q781A778
325615A31N148r324O00K902m55m958J914K543M819j044J119j475o89K724J176C676
306784a001j377N087q79j20q42R98L060j353p2k689J584J83q96J275q18r54N34c252
285560F25O45k084l400L122J316K788J413l024R69P68K438k819p80L586j380j41A733
265280A593L015n89n56l291l45M270n59J171q89l131j262L950M10k549k390O91H93
$$ plain form
394115 -3650 2593 1705 6412 997 2053 919 278 7814 5972 2666 4774 -822 -5795 4054 -1541 -1154
375826 7888 11147 7310 6545 12781 10072 5159 7138 6394 14824 7374 10416 1027 -1072 -2180 2251 1558
357396 -726 9649 11184 2044 374 3807 4663 11325 -856 -2838 -145 10048 52597 301353 755527
341010 980770 724055 246385 45417 10191 1602 -5903 -4425 -598 5228 763 -3689 5092 1778
325615 131 5279 -4045 -3445 -543 -998 -5956 -4042 -1499 3320 2276 3395 1920 1231 3955 5131 3676
306784 -1001 -2378 2709 1830 1710 868 1866 4926 3573 3501 812 2396 2579 1683 2958 2140 1186 1720 -3252
285560 625 1270 -814 -4214 -1092 224 3012 4425 1401 2370 3138 5576 2757 1977 5563 4183 4042 1733
265280 1593 4608 4019 3463 172 -173 4097 3538 4709 3820 689 -573 3377 3787 1238 -1152 -461 893
244828A204p99J139k64j724M571P96k468j41R05j478K515n74R89q20O287J4034D9157
224203F5356j0179k8291j5478p133o589K751j684J253K54q43N78k961J680J457c54
205722a160k28J838J958m04r17K07J812n32J341J41P69Q23p96j545j069J850J41D480
183594B691r56l29L98j117L66L475j529J10N19j177k37l55j88j93J01j29r78n98f59
160086a65q28m42R4J113p7J819Q38q9J521k116k769q61J415O27r30N30r74J138D18
136354E88j095p02k30K7N68J18N08o76J237m19j681K48q15k8N27l4J060K37J360A529
111193b49Q0L54J03m34J095L58M43m38p12L350L894N466P431J6413L6936O1195B04669
89425B49598m574m6916o0344n3441l3914j9123j0568o778m528k615j317j408C552
$$ plain form
244828 1204 405 1544 1280 -444 4127 4923 2455 2314 3219 1741 4256 3682 4671 3851 10138 24172 49157
224203 65356 55177 26886 11408 4275 -2314 437 -1247 6 260 -583 -5 -2966 -1286 171 -354
205722 -1160 -1388 450 2408 2004 1087 1294 3106 2574 3915 4056 4825 5648 4852 3307 2238 4088 4229 4480
183594 2691 1735 1406 1804 687 1053 4528 2999 3109 3628 2451 2214 1859 1671 1478 1579 1450 472 -126 -659
160086 -165 -993 -1435 -1341 -228 -305 1514 2352 2263 3784 1668 -1101 -1962 -547 80 -850 -320 -1294 -156 418
136354 588 -507 -1209 -1439 -1412 -844 -726 -218 -894 343 -76 -1757 -1509 -2324 -2352 -1825 -1859 -799 -562 798 1529
111193 -249 -169 185 288 -146 949 1307 1750 1312 600 3950 7844 13310 20741 37154 74090 135285 204669
89425 249598 245024 198108 137764 84323 50409 31286 20718 13940 9412 6797 5480 4072 3552
72365C238l8p20J696D164
$$ plain form
72365 3238 3200 2480 4176 4164
66244D818  $$checkpoint
##END=