##TITLE= Raman spectrum of Epsomite � http://rdrs.uaic.ro
##MINERAL= Epsomite
##CHEMISTRY= MgSO4*7(H2O)
##JCAMP-DX= 5.01
##DATA TYPE= RAMAN SPECTRUM
##DATA CLASS= XYDATA
##ORIGIN= Department of Geology, UAIC, Romania
##OWNER= http://rdrs.uaic.ro � stud. Apopei Andrei Ionut
##LONGDATE= 2009/11/09 02:13:18.0136 +0200 $$ export date from JSpecView
##XUNITS= Raman shift (1/cm)
##YUNITS= Intensity (cnt)
##XFACTOR= 3.188736E-3
##YFACTOR= 2.56894426E-3
##FIRSTX= 3399.97
##FIRSTY= 70.26294624
##LASTX= 211.234
##NPOINTS= 1024
##XYDATA= (X++(Y..Y))
1066244B7351L789k678k056k649k360m993j58J58l201j534k728j043N06m183k01C823
1053066C325o04j527k270J678K97o05J781r98o9q28O52m99n50o84j13J346r08l35b33
1037439h45K139j182J167j966n49l40O67J166J707o23M03j157P33k086J014r52A098
1023258A467K50m06j305n2j034J295j485J505J554j257K50j416R91J097k357K6d14
1008970B188n81j46K8l8j199j200j650K953J95J436k787P90J26J013m85l55j347a337
993764B64j196Q59J131M09j836l89O59Q44P44j067j125J531m74O7q81J887j489a568
978435B62L28j089J408k536J556J165q46q42m45K119n40o91R74n89K66o21r14b47
962977AR0L06j472j64J240o60J437r64m25Q82o38n52J156j542m45R06K697o42B036
$$ y = [27351, 31140, 28462, 26406, 23757, 21397, 16404, 16246, 16404, 13203, 11669, 8941, 7898, 8404, 4221, 4020, 3823, 3325, 2721, 1194, -1076, 602, 899, 294, 2075, 1077, 1008, 180, 832, 333, -217, -901, -1014, 332, -576, -911, -233, -845, 1294, 112, 1279, -687, -1236, -1576, -909, 257, 1964, 1341, 1744, 587, 1320, -766, 248, -704, 1098, 1467, 1717, 1311, 6, -46, -1080, 215, -1270, 235, 1789, 532, 782, -634, 357, 1454, -903, -877, -414, 2188, 1607, 1461, 1489, 1451, 252, -948, -2598, 355, 550, 1986, -801, -11, 115, 1128, 643, 288, -1059, -1337, 264, -932, -73, 1058, 1467, -369, -758, -99, 745, 1489, 422, -703, 828, 354, 421, -460, 1427, -62, -1568, 262, 590, -499, 909, -1627, -71, 1094, 248, -594, -1039, 1080, 540, -151, 823, 234, 500, -121, -1035, -247, 1, 91, 397, -1075, -1239, 1, -659, 778, -186, -611, 271, -367, -919, 237, -1305, -1750, -844, 1853, 1211, 2036]
946566A07M7j083Q00J745l71j035p15l68P54r0m09J275l071J150J258m92J091h50
930845f87R75k49n23P19P57O68k524J084j94N44k06J20Q58j879q57L35J398j112B44
914155b71Q95O96j011K70k81O54p59j527K86J083L53n29J716j377j174K91m05d97
898165h67K931p04p69j512M79n87J517J143J451k295j324P26N41L33j476r39N20g15
882042H79j070q25o26J643O93P7J143k627Q88p93M56q62J686Q78k02m94p99J056F46
864923A806r8p4j965m75J44R86n07K29J360j260N19R73j807K83p48O44n93j89c39
847652b42N9J643l40j217P14j09l75m37k93k87R8l5j343L298L5q37L84j2J081F99
829357e93K74J244r70J332k357K026K42j865Q19p03K03R59j99j092m33K68J195B101
$$ y = [107, 154, -929, -129, 1616, 1245, 210, -505, -873, -119, -209, -618, 657, -2414, -1264, -6, -498, 593, -850, -687, 288, 39, -484, 235, 992, 1660, -864, 220, 26, 570, 364, 484, 1342, -537, -1394, -1059, 339, -773, 244, -271, 624, 1320, 309, 579, 298, 952, 193, -1334, -1048, 35, 388, -141, 1575, 198, -976, -685, -1090, -497, -867, 2064, 1360, 591, -921, -442, -1029, 488, 1631, 3082, 787, -537, 189, 730, 1063, -413, -1352, -832, -715, 879, -191, -1016, -1642, 1, 694, 771, 1914, -713, 175, -618, -162, -1024, 662, 1540, 1338, 844, 45, 1101, 646, 1806, 1708, 1634, -331, -806, -662, 324, -183, 46, 1406, 146, 665, 1638, -169, 114, -634, 10, -583, -772, -339, -242, -183, 1460, 1120, -97, 617, 508, 133, -304, -597, -884, -786, -821, -2164, 1134, 1169, 332, 716, 704, 1785, 699, -593, -319, 925, -45, 1287, -1070, 956, 1198, -667, 152, -551, -348, 611, 412, -680, -1113, -845, 350, 2101]
812657C641m074j425J079J867p87J190q82o31k84Q01l88J242k123j357M00K584F72
796704C70q96J098j84k347N29J187L90J86q59p76J996J56k258oO00J5J385M33F20
778832F54O62j690O97N92j343K39j698L0L40K780k08j031Q80j313N52M51p06m68c44
760800dj256J673k00M63j834L50N78m74N79q21J811r30J76l5Q02j921K60j68R19c71
741692A651j499J093j550J024p36j019Q91m67J400j673p96K495q94N04j194R48A67
725171e17J41l43O02k75l65k00J147J18p71N46J59Q13j480J663k707K107J53j36A106
706662H2Q97m06o75N14j133M76r54J449j44j21M4J3n98K67l26N48m20O66j71o81A038
686106B45L72j216J217j0l21L39l66m68M90N51r01m24K030k114K348j125n05M44A487
$$ y = [3641, -433, -1858, -779, 1088, 301, 1491, 609, -22, -306, 495, 107, 1349, -774, -2131, -1731, 853, 672, 370, -526, 572, 388, -1959, -1430, -243, 147, 333, -526, -1302, 694, 850, -1408, -1414, -814, -799, 586, 1019, 620, 654, 1316, -374, 323, 915, -428, -189, -1887, -1857, -1517, 1263, 1055, 24, 904, -409, 143, 594, -112, -580, -344, -4, -1260, 413, 213, 676, -1158, -808, -230, -704, -125, -946, 865, -65, 111, 76, 878, -1043, -783, -951, -32, -371, 1651, 152, 1245, -305, 719, -17, -1036, -145, -612, 788, -885, -1681, 814, -80, 424, -770, 178, 167, -517, -376, -719, -117, -392, -757, -957, 190, 308, -463, 83, 242, 1055, -425, 1238, -1469, 638, 791, 655, 1106, 82, 979, 573, -102, 412, -721, -245, -1199, 250, 106, -15, 29, 42, -556, -289, -615, -67, -487, 179, 8, -673, 1038, 245, 617, -599, 618, 608, 287, 626, 260, -208, 282, 833, -68, -492, 1538, -576, 1772, 647, 142, 586, 1487]
667246A128k97j170J338n43N5R4j226J485j324N66j26L04m40k95m23J168p9o79a73
648213h82J384j495K023p54M93j698J297m94j65j28R81M08j380L98j70j66N54D98
629974C28N51p06m78O87J073p72j930R94L80k30M37L84K28j383Q11j64P67n59b3
610606G9o50J060j182n0J550j036Q78l75P4j129J289j340J279P8n80n15Q29k53d13
591062A11P00J78j578O53k68J004k98N99n76q68J339j163l5j262j4n79k23L703b15
571342A021j647n90O50Q61J486j328j0J372j498q24J116M48k90j93L72O4m90n81D78
551441f45K86o42K6O07J225j65j480Q87M97j635J768k034K095p09o73l25p6L87a20
531358B78k63Kk59l08K74L3K31j0M63J42q0M21j314J366j068L75Q24j269P3K21g20
$$ y = [1128, 831, -339, 999, 456, 511, 605, -621, 864, -460, 106, -20, 284, -156, -451, -874, 294, 215, -464, -173, -882, 502, -993, 1030, 276, 769, -929, 368, -126, -291, -419, 562, 970, -410, -12, -182, -348, 206, 498, 328, 879, 173, -305, 382, 1455, 683, -1247, -253, 127, -103, 334, 718, 946, -437, 374, 210, 977, 418, -23, 79, -571, 489, -693, -743, 807, -229, 649, 274, 348, -781, 508, -832, 447, 525, -55, -570, 259, 6, -413, 111, 811, 989, -589, 64, -204, 800, 502, 1101, 525, -343, 996, -167, -202, -1464, -1478, -2057, -2280, 1423, -215, 1021, -626, -1216, -566, 295, 1781, 453, 443, 1815, 317, -507, 609, 1057, 767, 574, 946, 1010, 520, -61, 478, -645, -359, -1001, -975, -368, 857, 692, -788, 99, 596, -1039, 729, -1305, 790, 81, -592, -917, -993, -606, -120, 278, 15, 17, -242, -550, -276, -243, -12, -22, 441, 583, 503, 924, -390, 976, -92, 283, 1107, -162, -89, 132, -720]
509058e13R20N06r37O66P02q13p94L61N61j523J028K13n37l47O9N56m84J35Q31A87
487557E67P60k111j71R92N8R6M91j263R24o07J340j795j96k10K098j117j219j68b03
466890h16J654N3O59p47J051q95J531L47k337j552J207j520P7Q68K92l44Q65l77I57
446033g24n56O51j127K613o06j190J199j299k53J683O57o68N17O75q78j398J629a020
426040D73L60k022%J656j90Q3l32J880r70N7p36L25l52l42P0q16J60J212K64j820a465
402671C36k79n33K8R47J70k52P10q16J17Kj231Q95R24p88mo64J11k62L05k64J14F00
377987ak58p72J367Q26o88J319m74j083K206J557K812K754L150K889M858K494B4086
358484B2131l391n764k691m888l922P11K848J727j473J889O062M235M128M780B9996
$$ y = [-513, 407, 913, -24, 642, 1344, 531, -263, 98, 659, -864, 164, 377, -160, -507, -438, 118, -366, -231, 600, 187, 567, 1327, -784, -955, 37, 95, 191, 682, -581, 343, -264, 1076, -719, -915, -1125, 973, -144, -1363, -1531, -203, -816, 838, 891, 1550, 803, 1854, 959, 2490, 2837, 500, -1052, 155, -1365, -1288, -420, -128, -472, 393, 16, 957, -724, -1280, -629, -1756, 857, 251, -939, 260, -1039, -1292, 391, 1048, 380, 897, 1572, 694, -704, 925, -1020, 473, 833, -1189, -1189, 467, 277, 360, 28, 1908, 938, 995, 259, 584, 232, -110, -40, -856, -696, 516, 780, -1040, -1465, 336, 57, -476, -448, 499, 669, 417, 1127, 311, 428, 430, -801, 94, 1018, 230, 226, -438, -327, -589, -284, -548, -434, 600, -1, -259, -1031, 336, 1162, 474, 1793, 1319, 236, 2442, 3999, 6811, 9565, 12715, 15604, 20462, 22956, 24086, 22131, 18740, 12976, 10285, 5397, 1475, 2186, 5034, 6761, 5288, 7177, 13239, 17474, 21602, 26382, 29996]
341010C2892J086l029m386n653o808k904l564n733O51J204k497O46p87p2N70o41B084
321196B523k17j073L139M169M772O208J8417O5869K45214M00652K46099j81757C95677
305671A35049p8151k2925j1055p433m325l184l977k550p7n04J313J562J021j389C058
287804A802N39N54k798j613m49K60L721J815k37l49J460j112r45j268k17M82k482a089
266412b325n7R19n70j421R3q67J861j76K38p37K77J027P67L89k006m12R92Q49E08
243687A673j191K126j688j228J150j119K126j063M10l54L71R67j766K808O36J413C687
223052C063j171J757K617O37J724P4O07J63K012Q66r54R49O83Q3J967L731L148B5898
201079C1016L397N568M480M881L051O215N450K431j532m582n764m649q083k172C2641
$$ y = [32892, 33978, 30949, 26563, 20910, 14102, 11198, 7634, 1901, 2552, 3756, 1259, 1905, 1118, 1046, 1616, 975, 2084, 2523, 2306, 1233, 4372, 8541, 13313, 19521, 37938, 103807, 349021, 749673, 995772, 814015, 395677, 135049, 56898, 33973, 22918, 15485, 11160, 7976, 3999, 1449, 1372, 868, 2181, 3743, 4764, 3375, 3058, 1802, 2341, 2895, 97, -1516, -1965, -1705, 2016, 3831, 3594, 3245, 4705, 3593, 2648, 1380, 1163, 1645, -837, -1089, -2325, -2382, -1463, -2033, -3454, -3361, -4228, -2367, -2543, -2305, -3042, -2765, -1738, -971, -582, -2588, -3000, -2008, -1159, 508, 1673, 482, 2608, 920, -308, 842, -277, 1849, 786, 1196, 842, 1213, 2180, 414, 3222, 3858, 5271, 3687, 3063, 1892, 3649, 6266, 6903, 8627, 8701, 9308, 9471, 11483, 12349, 11395, 12344, 13027, 13110, 15077, 18808, 21956, 25898, 31016, 34413, 39981, 44461, 49342, 52393, 58608, 64058, 66489, 64957, 60375, 54611, 49962, 41879, 39707, 32641]
182424B8231l616j772j400l162j933k359j500l021p96j798k129j785K77K099k87F599
162447F020Q00j867K036P60M93J709N337Q257J2637J7900J9923J6897Q433l396H8312
143498G6926j0207n509q917q252q174r411p156l246k574k592j048j354k037k970B106
124404A609j042J457J163J270L318M967L421J831p7k419j609k195j228r22k114E919
103957D587R1m72q96M04J925J30j485J035RK204J047K597J086J984K209L289N034B9518
80909C7571N563O479K942J851k181O00j001j763M00j723D8045
$$ y = [28231, 24615, 22843, 21443, 18281, 16348, 13989, 12489, 9468, 8672, 6874, 4745, 2960, 3237, 5336, 5049, 6599, 6020, 6820, 4953, 6989, 7749, 8242, 9951, 15288, 23545, 36182, 54082, 74005, 90902, 99335, 95939, 88312, 76926, 66719, 61210, 52293, 44041, 35867, 26456, 19300, 16054, 13480, 10888, 9840, 8486, 6449, 3479, 2106, 1609, 567, 2024, 3187, 4457, 7775, 12742, 16163, 17994, 17917, 15498, 13889, 11694, 10466, 9544, 7430, 5919, 4587, 4678, 4206, 3310, 3714, 5639, 5769, 4284, 5319, 5328, 7532, 8579, 11176, 12262, 14246, 16455, 19744, 24778, 29518, 37571, 43134, 49613, 52555, 54406, 52225, 52825, 51824, 50061, 50461, 48738, 48045]
66244D5436  $$checkpoint
##END=