##TITLE= Raman spectrum of Galena � http://rdrs.uaic.ro
##MINERAL= Galena
##CHEMISTRY= PbS
##JCAMP-DX= 5.01
##DATA TYPE= RAMAN SPECTRUM
##DATA CLASS= XYDATA
##ORIGIN= Department of Geology, UAIC, Romania
##OWNER= http://rdrs.uaic.ro � stud. Apopei Andrei Ionut
##LONGDATE= 2009/12/11 02:26:34.0407 +0200 $$ export date from JSpecView
##XUNITS= Raman shift (1/cm)
##YUNITS= Intensity (cnt)
##XFACTOR= 3.188909E-3
##YFACTOR= 3.46267096E-4
##FIRSTX= 3399.61
##FIRSTY= -0.45586098
##LASTX= 210.701
##NPOINTS= 1024
##XYDATA= (X++(Y..Y))
1066073a317%m00l98l97o91p96p96p97p97J901R377r41r391l464Q366P750k111a535
1051341a581O998L778n038o717J084P308L365n204p459j012M936L196k305l686b443
1038838F1Q47j549m57K655L176J44k831l024j725j074n51J250L065K180j020k673b013
1024673E32J001l281m833j168L572L989M85j697J60K867K334n73j626M52K187N11B136
1010396a358j496J293J603L07q4O64P67l46j147o09J50j14n07N62K290J875j426b049
995202e888o4L868K970R96R14K233K086o05m795l609p00R93Q68R15K052K362K8A253
979887c162Q7K407K039J1o46R00K439K064O46J1M1q00k373m563l157J112K788F69
964443a54q89p75k40K47J161K084J488r73l165k699l9J817R42j267k038n99J362a733
$$ plain form
1066073 -1317 -1317 -1717 -2115 -2512 -3203 -3999 -4795 -5592 -6389 -4488 4889 3948 -5443 -8907 -541 7209 5098 -1535
1051341 -1581 5417 9195 4157 -2560 -1476 5832 9197 3993 -3466 -4478 458 3654 1349 -2337 -2443
1038838 61 908 -641 -1098 1557 4733 4877 2046 -978 -2703 -3777 -4328 -3078 -13 2167 1147 -1526 -2013
1024673 532 1533 -1748 -6581 -7749 -4177 -188 297 -1400 -1240 1627 3961 3388 1762 2214 4401 4912 2136
1010396 -1358 -2854 -1561 42 349 265 929 1696 1350 203 -406 -256 -370 -877 -315 1975 3850 2424 -2049
995202 -5888 -5952 -2084 886 1882 2796 5029 7115 6510 1715 -1894 -2594 -1601 -733 182 2234 4596 4624 1253
979887 -3162 -3075 -668 1371 1382 736 1636 4075 6139 6785 6796 6837 6037 3664 -899 -4056 -2944 -156 669
964443 -154 -1043 -1818 -2058 -1811 -650 1434 2922 1949 -1216 -3915 -3954 -2137 -1195 -2462 -4500 -5099 -3737 -1733
948870d36K97n43j278j547q08M96J000J33r31o95O82J653J415Q16P97Q59o4j623a916
932341b801O89P45n16r79l36O08L85p53j312o32N64J606K695L764L538R78k553A750
916502@J280K926J850K32r7P9q17k245j992M43K514J655j192k441k89K913L380H513
900531E235l963j272K007L863K995L57k204l090j953k9R29M57j62L79J457J112D791
885278H56m163j785Q78J680Q52J53M56R85Q02J54l55m67p73j571k373k541j989a0180
869050i811J965L790M359L686L218J006j472l561l952j810J425J124J802P76m43G23
854411A248o63j199K7J822K239J006J55J266K618J730j456m120l805j080J726C190
839663D078K124J328k467o939l478K96L840L949O79k102j438J636J173L81K16C529
$$ plain form
948870 -436 -139 -682 -1960 -3507 -4315 -3819 -2819 -2686 -3617 -4312 -3630 -1977 -562 254 1051 1910 1846 223 -1916
932341 -2801 -2112 -1367 -1883 -2862 -3198 -2590 -2205 -2958 -4270 -4902 -4338 -2732 -37 3727 7265 8243 5690 1750
916502 0 1280 4206 6056 6288 6191 6270 5453 3208 1216 1659 4173 5828 4636 2195 1906 4819 8199 8513
900531 5235 1272 0 2007 5870 8865 9222 7018 3928 1975 1946 2875 3332 3170 3549 5006 6118 4791
885278 856 -3307 -5092 -4214 -2534 -1682 -1529 -1073 -88 714 868 513 46 -727 -2298 -4671 -7212 -9201 -10180
869050 -9811 -7846 -4056 303 3989 7207 8213 6741 3180 -772 -2582 -1157 -33 1769 2545 2102 723
854411 1248 585 -614 -587 1235 3474 4480 4635 5901 8519 10249 8793 4673 868 -212 1514 3190
839663 4078 6202 7530 5063 -1876 -5354 -5058 -1218 2731 3410 1308 -130 1506 2679 3060 3276 3529
824809C322j446L41L77K019K708N63k952n513n967o14L371L453J05k699j953j298e277
808954c046J134j669j805L05K684K967J228l35K19L30q46k327j567J691M081K352C215
792973a370k029K673M320J416k403l068p69J069N81m20%J759L134J789n85j369D529
776868E487M73j177k474k748k357j445L46K677L846K337r90l091j745J815L935G282
761536F109k807m68J912K122m33l129l285j096J033r34j327q45L28R49N96K46e32
745176b37n76j865k225K35K910K791P11l72J122K519O02k884k805M306J2329J2747C2993
728688B5582j1550p428j570m8k189l149p53K301K728Q37p58n98k3m76j372j297d2
712065C15P8j35N13J223O62j046k358k263j367p34m41O0O24N04k18k95R39K148d46
$$ plain form
824809 3322 1876 2217 2594 4613 7321 7884 4932 -581 -6548 -7162 -3791 -338 -233 -2932 -4885 -6183 -5277
808954 -3046 -1912 -3581 -5386 -5081 -2397 570 1798 1463 1682 2012 1166 -1161 -2728 -1037 3044 5396 3215
792973 -1370 -3399 -726 3594 5010 2607 -461 -1230 -161 420 0 0 1759 4893 6682 6097 4728 4529
776868 5487 5960 4783 2309 -439 -2796 -4241 -3895 -1218 2628 4965 3975 884 -861 954 4889 7282
761536 6109 3302 2834 4746 6868 6435 3306 21 -1075 -42 -976 -2303 -3148 -2820 -1871 -1275 -1029 -532
745176 -237 -813 -2678 -4903 -4668 -1758 1033 1744 1372 2494 5013 5615 2731 -74 4232 16561 29308 32993
728688 25582 14032 6604 5034 4986 2797 -352 -1105 1196 3924 4761 4003 3405 3382 2906 1534 237 -42
712065 315 393 258 771 1994 2656 1610 -748 -3011 -4378 -5112 -5553 -5493 -4869 -4365 -4583 -4878 -3939 -1791 -446
693438c21k070j792j16K25j488k755r06L314O176N012j074m349l511n81J242L89d293
676529f623n49J866K128L127j113k962o94R97K723K760P52p53p60O84L62j163a009
659486a816O06O64M179K186J6l893m94K225K269p25k676m084k920L38K571J912f44
642301c269j812L03J819K106J910J710P42J004J188j040m7m210j323j03r66j730d586
624982b724M466J951j209k199k85l82P00P2k94P33J825J028j370k854j734O86A61
607518I45k56M07J866J720o65l159l387j476L87P00R61L19L3m78j118r18N48K182A012
587947A929r20j554o55Q69J862J769P97L81N21N5o59j779k349j143J571K402J924E007
569192C857k54J083O19j423k503j148J008J393m6q64L77J964J342j248k813j344A542
$$ plain form
693438 -321 -2391 -4183 -4299 -4074 -5562 -8317 -9223 -5909 267 5279 4205 -144 -3655 -4236 -2994 -2605 -4293
676529 -6623 -7172 -5306 -3178 -51 -1164 -4126 -4820 -3823 -1100 1660 2412 1659 899 1583 1945 782 -1009
659486 -1816 -1210 -546 3633 5819 5835 1942 1448 3673 5942 5217 2541 -1543 -4463 -4125 -1554 358 -644
642301 -3269 -5081 -4778 -2959 -853 1057 2767 3509 4513 5701 4661 4614 404 -919 -1022 -1988 -3718 -4586
624982 -2724 1742 3693 2484 285 0 -382 318 390 96 829 2654 3682 2312 -542 -2276 -1590 161
607518 945 689 1096 2962 4682 4017 858 -2529 -4005 -3618 -2918 -1957 -1638 -1605 -2083 -3201 -4119 -3571 -1389 1012
587947 1929 1009 -545 -1200 -331 1531 3300 4097 4478 4999 5054 4395 2616 267 -876 695 3097 5021 5007
569192 3857 3603 4686 5305 3882 1379 231 1239 2632 2586 1722 2099 4063 5405 4157 1344 0 1542
551273D538J817l18j473j414q80q1J051J727Q15j296k545k061M85J869J333M76D790
533207F208Q48r42k173k952k237j040k8J115J656M998L67k605j059k393P66N73A27
514991a102K177M454Q99j716m279n09P37j315k965j522K149L686K057M3J63N004A0540
496628I554j865k095R7P03j282j879O08L204K341j344l109k006m91n09j583j336d05
478113A375O07j229r20J483K996N55k115k420o7K347K416O41p26p07m28j134k334b076
458401b801J540K478J321o81o28l19J065J833J061n00j392j201q18q86p04O13B268
439570D647M79j803r98J819K821K93l125l539p31J609P47j602j856M55K133Q52E51
420583a522q3J513R32k41J92J470R49j626l432l320Q31K540K55j271p63M12J346a059
$$ plain form
551273 4538 6355 6037 4564 3150 2270 2189 3240 4967 5782 4486 1941 -120 365 2234 3567 4043 4790
533207 6208 7056 6114 3941 989 -1248 -2288 -2316 -1201 455 5453 5820 3215 2156 -237 529 1102 127
514991 -1102 1075 5529 6428 4712 433 -76 661 -654 -3619 -5141 -2992 694 2751 2794 2957 7961 10540
496628 9554 7689 5594 5691 6394 5112 3233 3841 7045 9386 8042 4933 2927 2436 1927 344 -992 -405
478113 1375 1982 753 -167 1316 4312 4867 2752 332 265 2612 5028 5669 4943 4236 3808 2674 340 -2076
458401 -2801 -1261 1217 2538 1857 1229 910 1975 3808 4869 4369 2977 1776 958 72 -632 -19 2268
439570 4647 5126 3323 2325 4144 6965 7258 4133 594 -137 1472 2219 617 -1239 -784 1349 2201 551
420583 -1522 -1605 -92 840 599 791 2261 3210 1584 -1848 -5168 -4337 -1797 -1542 -2813 -3576 -3164 -1818 -1059
400369a108J47M63J511J897J972J384m60k566k627n7K423J789j191k591m73K329D755
381052C191l633j582J306P84M14j620l97J903J535q71j030%K850L903Q05k546A941
361575C68m52k37K43J205J379K55p72m40L05l20j943k028O20L692L851Q60k089B273
340841A525N53K03j019j658j512L86P54Q15N38j68p17m60K103K419Q63k45K87E864
319921F105k256m484k110L381O106M551K186L000O910J1357J6615K6582M2609A78467
303276B39238M4416J3473j9518m3157n3062n1184m2149l0754k0842j4245j0286D863
288755I77j606j21J13q0k18j39N55K012L156K323n30k754j596J065K888J803r12D442
267373B437p72pN59J307J454k274l679k872r1J841O84j180m51J39P97k44j729e490
$$ plain form
400369 -1108 -961 -498 1013 2910 4882 6266 5806 3240 613 556 2979 4768 3577 986 513 2842 4755
381052 3191 -442 -2024 -718 66 480 -1140 -1537 366 1901 1030 0 0 2850 6753 7558 5012 1941
361575 368 -84 -321 -78 1127 2506 2761 1989 1549 1854 1534 -409 -2437 -1817 1875 5726 6586 4497 2273
340841 1525 2078 2281 1262 -396 -1908 -1522 -768 47 585 417 -300 -760 1343 3762 4625 4380 4667 5864
319921 6105 3849 -635 -2745 636 6742 11293 13479 16479 23389 34746 51361 77943 120552 178467
303276 239238 283654 297127 277609 234452 181390 130206 88057 57303 36461 22216 11930 4863
288755 977 -629 -750 -637 -717 -935 -1074 -519 1493 4649 6972 6442 3688 2092 3157 6045 7848 6936 4442
267373 2437 1665 1658 2217 3524 4978 2704 -975 -3847 -3938 -2097 -1413 -2593 -3044 -2905 -2108 -2352 -4081 -5490
245799e098J169R0n64J162L505K980o96l749l084k03J106J336M73J583L138K399E221
225184C096j553j53M64J114J715K062J210k184m355k681O53J564l15j387L85K347C209
204393A628j628J071L770J662k763l537J097O818R347R323R258Q048K316p015B6035
185763A4192n656k089l239m242j276K482J695k666m033M12N327M486j216k986B229
166992G063K744k506l726M43L766J595k477j949K718K018J904J315L881O453L512B3348
146892A7533Q48J0540J3948R986N929O647Q657O632J685j008p73k342p272r682E7262
127826F2936J0017O378K585O006J3497J6384J2966J0100J2128J4119R835K295A79759
111023A86452J3123J3532J1923J5314K1555K1781J4604J0049J5463K4136K5831C99114
$$ plain form
245799 -5098 -3929 -3839 -4403 -3241 264 3244 2548 -1201 -4285 -4488 -3382 -2046 -1573 10 3148 5547 5221
225184 3096 1543 1390 1854 2968 4683 6745 7955 5771 1416 -1265 -612 952 637 -750 -365 1982 3209
204393 1628 0 1071 4841 6503 3740 203 1300 8118 17465 26788 36046 44094 46410 39395 26035
185763 14192 8536 6447 3208 -1034 -2310 172 1867 -799 -4832 -4420 907 5393 4177 1191 2229
166992 7063 9807 7301 3575 4018 7784 9379 6902 4953 7671 9689 11593 12908 16789 23242 26754 23348
146892 17533 18381 28921 42869 52855 58784 65431 74088 80720 82405 81397 80624 78282 71010 61328 57262
127826 62936 72953 79331 81916 87922 101419 117803 130769 140869 152997 167116 176951 179246 179759
111023 186452 199575 213107 225030 240344 261899 283680 298284 308333 323796 347932 373763 399114
95320D39093P4944J10328J20655J03046P5836N0094J5824l6660r2156j22440F17477
80739E06942j08474j02065p1865l2659k4855n6329p6761l8419P733%C248
$$ plain form
95320 439093 514037 624365 745020 848066 923902 973996 989820 953160 861004 738564 617477
80739 506942 398468 296403 224538 191879 167024 110695 33934 -4485 3248 3248 3248
66073A969  $$checkpoint
##END=