##TITLE= Raman Spectrum of Glaucophane (blue, black and red) � http://rdrs.uaic.ro
##JCAMP-DX= 5.01
##DATA TYPE= LINK
##ORIGIN= Department of Geology, UAIC, Romania
##OWNER= http://rdrs.uaic.ro � stud. Apopei Andrei Ionut
##BLOCKS= 3
##TITLE= Raman spectrum of Glaucophane � http://rdrs.uaic.ro
##MINERAL= Glaucophane
##CHEMISTRY= []Na2(Mg3Al2)Si8O22(OH)2
##JCAMP-DX= 5.01
##DATA TYPE= RAMAN SPECTRUM
##DATA CLASS= XYDATA
##BLOCK_ID= 1
##ORIGIN= Department of Geology, UAIC, Romania
##OWNER= http://rdrs.uaic.ro � stud. Apopei Andrei Ionut
##LONGDATE= 2010/10/10 11:27:43.0319 +0200 $$ export date from JSpecView
##SPECTROGRAPHDATASYSTEM= HE 532 (Horiba Jobin-Yvon)
##XUNITS= Raman shift (1/cm)
##YUNITS= Intensity (cnt)
##XFACTOR= 3.188909E-3
##YFACTOR= 9.90743639E-4
##FIRSTX= 3399.61
##FIRSTY= 314.43227821
##LASTX= 210.701
##NPOINTS= 1024
##XYDATA= (X++(Y..Y))
$$ plain form
1066073 1161365 1177481 1175924 1182680 1178000 1186254 1183198 1176664 1191914 1197536 1197363 1187311 1186821 1193567 1193663
1054452 1192164 1185140 1181075 1193317 1187629 1200861 1194701 1189993 1192308 1206358 1208184 1201947 1209097 1192510 1203206
1042755 1194509 1211182 1202120 1203446 1208078 1210298 1213181 1203206 1211432 1212739 1212075 1214660 1212220 1217178 1225750 1223040
1030196 1210154 1219417 1220993 1219023 1213872 1218014 1214785 1214094 1221531 1227749 1228931 1231833 1226163 1230776 1233909 1234639
1017545 1233111 1233784 1235898 1245440 1236859 1244354 1245113 1238934 1238435 1231516 1236465 1240876 1241145 1244422 1243912 1241423 1250533
1004014 1245556 1240405 1241616 1250312 1253051 1244748 1257116 1252340 1246228 1253349 1257087 1267043 1254358 1253176 1253983
991988 1254771 1263545 1259730 1255665 1260422 1269339 1255146 1260191 1252311 1279093 1265150 1271502 1272520 1275057 1275941
979887 1272587 1272741 1267562 1278353 1281015 1280208 1279564 1278132 1279708 1277440 1290625 1277373 1290654 1300705 1285628
$$ packed form
1066073A161365J6116j557O756m680Q254l056o534J5250N622j73j0052m90O746A193663
1054452A192164p024m065J2242n688J3232o160m708K315J4050J826o237P150j6587A203206
1042755A194509J6673r062J326M632K220K883r975Q226J307o64K585k440M958Q572A223040
1030196A210154R263J576j970n151M142l229o91P437O218J182K902n670M613L133A234639
1017545A233111O73K114R542q581P495P59o179m99o919M949M411K69L277n10k489A250533
1004014A245556n151J211Q696K739q303J2368m776o112P121L738R956j2685j182A253983
991988A254771Q774l815m065M757Q917j4193N045p880K6782j3943O352J018K537A275941
979887A272587J54n179J0791K662q07o44j432J576k268J3185j3252J3281J0051A285628
$$ plain form
967704 1292297 1289193 1294517 1280650 1291807 1297207 1294719 1296564 1293431 1299274 1296266 1299523 1305414 1310930 1300609
955443 1294843 1292009 1298860 1303780 1303271 1302108 1312881 1307576 1315370 1313198 1313938 1300782 1315783 1303588 1309873
943100 1319627 1316494 1328650 1313813 1322116 1314697 1321126 1328448 1321232 1328256 1312189 1328794 1322020 1320223 1323029
930679 1331802 1322490 1315783 1319454 1317263 1324854 1322779 1328593 1328256 1332023 1342171 1333301 1333772 1335319 1333301 1341306
917339 1331629 1348264 1342786 1347197 1342498 1337664 1340278 1337395 1347620 1353213 1349791 1355874 1347245 1353068 1341633
904748 1349686 1358094 1355259 1358113 1349686 1351291 1359564 1346582 1347841 1365705 1367281 1382628 1383079 1349840 1368761
892073 1367377 1360016 1365561 1380437 1378102 1371077 1372509 1374258 1363754 1374652 1368761 1370212 1381667 1368146 1367723
879316 1388960 1380389 1380859 1394092 1385020 1388816 1380196 1379130 1383617 1382214 1374383 1385366 1372086 1386356 1385443
$$ packed form
967704A292297l104N324j3867J1157N400k488J845l133N843l008L257N891N516A300609
955443A294843k834O851M920n09j163J0773n305P794k172P40j3156J5001j2195A309873
943100A319627l133J2156j4837Q303p419O429P322p216P024j6067J6605o774j797A323029
930679A331802r312o707L671k191P591k075N814l37L767J0148q870M71J547k018A341306
917339A331629J6635n478M411m699m834K614k883J0225N593l422O083q629N823A341633
904748A349686Q408k835K854q427J605Q273j2982J259J7864J576J5347M51l3239A368761
892073A367377p361N545J4876k335p025J432J749j0504J0898n891J451J1455j3521A367723
879316A388960q571M70J3233r072L796q620j066M487j403p831J0983j3280J4270A385443
$$ plain form
866475 1390786 1396139 1380658 1377141 1385222 1385760 1389162 1386990 1386135 1388672 1396062 1392410 1398676 1393054 1400252 1381551
852683 1388864 1389902 1399733 1396408 1383050 1391055 1404048 1394409 1386942 1393198 1383252 1374998 1393448 1396110 1396254
839663 1396033 1400742 1394851 1401059 1394313 1398407 1393006 1402933 1410496 1412792 1395418 1387807 1393352 1397369 1406633
826562 1396773 1409958 1409986 1401799 1400819 1413801 1405720 1419077 1405105 1400521 1403452 1389162 1397446 1399531 1404442
813372 1401876 1407565 1409881 1412149 1412024 1408920 1406315 1406729 1402193 1417943 1426323 1404682 1410400 1410947 1399435 1399829
799204 1416290 1402520 1424122 1422921 1409045 1410352 1410255 1408631 1394092 1403087 1410842 1418606 1399656 1384607 1390152
785833 1410476 1401213 1409785 1401088 1414099 1415060 1417299 1422594 1417943 1418875 1420509 1416828 1416636 1410303 1403769 1407103
771471 1413657 1408257 1416780 1427899 1414743 1437182 1430186 1430849 1433838 1423488 1424814 1433463 1427649 1428562 1430388
$$ packed form
866475A390786N353j5481l517Q081N38L402k172q55K537P390l652O266n622P198A381551
852683A388864J038R831l325j3358Q005J2993r639p467O256r946q254J8450K662A396254
839663A396033M709n891O208o746M094n401R927P563K296j7374p611N545M017A406633
826562A396773J3185K8q187r80J2982q081J3357j3972m584K931j4290Q284K085A404442
813372A401876N689K316K268j25l104k605M14m536J5750Q380k1641N718N47j1512A399829
799204A416290j3770K1602j201j3876J307r7j624j4539Q995P755P764j8950j5049A390152
785833A410476r263Q572q697J3011R61K239N295m651R32J634l681j92o333o534A407103
771471A413657n400Q523J1119j3156K2439o996O63K989j0350J326Q649n814R13A430388
$$ plain form
757911 1432310 1453201 1441938 1436077 1434030 1440785 1440689 1453864 1452538 1444408 1446503 1447214 1446176 1453624 1450366 1449213
743351 1456824 1453124 1467029 1467394 1475303 1474092 1477792 1473679 1467567 1465818 1479762 1487402 1479320 1480108 1488046 1485682
728688 1488488 1481242 1474390 1474198 1478330 1485384 1492303 1492178 1485134 1493139 1480771 1473525 1478705 1467596 1473583 1485115
713918 1481665 1491765 1479243 1478167 1472766 1483481 1485009 1478388 1479147 1482741 1474150 1483779 1481290 1483385 1470325
699976 1470306 1480973 1472497 1481194 1468038 1479858 1480531 1492207 1491322 1492601 1486518 1487998 1482203 1480877 1482078
685940 1489353 1479493 1479128 1473083 1479397 1482722 1491668 1488930 1497578 1496963 1487969 1487229 1491495 1491909 1502412 1492062
670863 1486585 1497944 1497357 1500269 1506919 1491620 1502854 1498395 1502383 1506448 1503392 1505122 1504747 1498981 1505189
656632 1506496 1503661 1503219 1504728 1506669 1496915 1501326 1500115 1497924 1502854 1491889 1484894 1489862 1500538 1510436
$$ packed form
757911A432310K0891j1263n861k047O755r6J3175j326q130K095P11j038P448l258A449213
743351A456824l700J3905L65P909j211L700m113o112j749J3944P640q082P88P938A485682
728688A488488p246o852j92M132P054O919j25p044Q005j2368p246N180j1109N987A485115
713918A481665J0100j2522j076n401J0715J528o621P59L594q591R629k489K095A470325
699976A470306J0667q476Q697j3156J1820O73J1676q85J279o083J480n795j326A482078
685940A489353r860l65o045O314L325Q946k738Q648o15q994p40M266M14J0503A492062
670863A486585J1359n87K912O650j5299J1234m459L988M065l056J730l75n766A505189
656632A506496k835m42J509J941r754M411j211k191M930j0965o995M968J0676A510436
$$ plain form
642301 1503815 1499327 1488978 1491322 1498981 1489026 1483529 1491861 1478042 1492745 1489939 1480377 1484096 1472295 1474986
627876 1475745 1486864 1473477 1488286 1482347 1477542 1470844 1468307 1472295 1472247 1479839 1477648 1476956 1482914 1492975 1485009
612382 1491495 1471997 1480012 1482520 1475178 1486249 1465742 1479272 1483856 1489247 1481165 1499500 1495580 1479022
598735 1490804 1487402 1497847 1499423 1498587 1502633 1498539 1505862 1501720 1493686 1503690 1507092 1507851 1505237 1503344 1498616
583027 1493859 1491688 1492850 1492082 1504449 1497944 1505141 1503911 1486268 1488046 1489641 1488536 1484894 1490679 1482107
568201 1478138 1479887 1471363 1485903 1485605 1483683 1475793 1477571 1470181 1469239 1470354 1470008 1457122 1467885 1456036 1459284
552270 1450885 1459707 1459188 1457958 1452884 1456459 1458794 1463945 1459409 1445561 1462369 1457074 1464906 1453499 1448050
537234 1463406 1457314 1459909 1459832 1467077 1452663 1469095 1460178 1467644 1474025 1471661 1460072 1454037 1460130 1460889
$$ packed form
642301A503815m488j0349K344P659r955n497Q332j3819J4703k806r562L719j1801A474986
627876A475745J1119j3387J4809n939m805o698k537L988m8P592k191o92N958J0061A485009
612382A491495j9498Q015K508p342J1071k0507J3530M584N391q082J8335l920A479022
598735A490804l402J0445J576q36M046m094P323m142q034J0004L402P59k614j893A498616
583027A493859k171J162p68J2367o505P197j230j7643J778J595j105l642N785A482107
568201A478138J749q524J4540k98j922p890J778p390r42J115l46j2886J0763j1849A459284
552270A450885Q822n19j230n074L575K335N151m536j3848J6808n295P832j1407A448050
537234A463406o092K595p7P245j4414J6432q917P466O381k364j1589o035O093A460889
$$ plain form
522094 1466827 1465597 1456161 1463820 1454239 1458746 1461014 1460024 1445955 1454873 1445436 1444927 1441275 1437480 1438565 1436125
505828 1434693 1438614 1427524 1422527 1421268 1421614 1425064 1424891 1425804 1424545 1412985 1414147 1405009 1398695 1397273 1402962
489446 1390421 1408478 1400521 1405989 1409371 1383963 1392362 1398916 1388797 1389258 1390959 1390171 1394880 1389633 1399339
473977 1396033 1386625 1386472 1387778 1391824 1405816 1406729 1398253 1401972 1400223 1389335 1397465 1400002 1408305 1393996 1388797
457360 1379677 1390517 1375930 1389114 1392660 1386375 1379428 1379629 1389066 1379284 1383963 1372086 1372999 1372009 1361909
441671 1354692 1364696 1362505 1365330 1358334 1361169 1358267 1350897 1354788 1350849 1350061 1335944 1339759 1339490 1336357 1343065
424816 1344093 1332907 1332734 1336578 1337933 1329851 1343084 1332734 1329707 1329832 1336703 1345400 1336501 1334464 1329611
408902 1329611 1339932 1335079 1346784 1343824 1336780 1341383 1332782 1339855 1348706 1333551 1342863 1341710 1333695 1328842
$$ packed form
522094A466827j230r436P659r581M507K268r90j4069Q918r437n09l652l795J085A436125
505828A434693L921j1090m997j259L46L450j73R13j259j1560J162r138o314j422A402962
489446A390421J8057p957N468L382k5408Q399O554j0119M61J701p88M709n247A399339
473977A396033r408j53J306M046J3992R13q476L719j749j0888Q130K537Q303j4309A388797
457360A379677J0840j4587J3184L546o285o947K01R437r782M679j1877R13r90A361909
441671A354692J0004k191K825o996K835k902p370L891l939p88j4117L815k69l133A343065
424816A344093j1186j73L844J355q082J3233j0350l027J25O871Q697q899k037A329611
408902A329611J0321m853J1705k960p044M603q601P073Q851j5155R312j153q015A328842
$$ plain form
392874 1335271 1337539 1329630 1337760 1334954 1341479 1312506 1318445 1320492 1321972 1317436 1312650 1309767 1321405 1312237
376740 1317119 1313438 1307038 1312977 1305164 1306442 1305510 1290798 1283850 1295036 1297525 1302454 1298361 1299101 1295603 1293287
359402 1289318 1286435 1294690 1298063 1303684 1287098 1292576 1291115 1303434 1302377 1304991 1314726 1315312 1312775 1309969
343033 1308710 1301983 1305856 1310786 1311516 1309969 1314159 1319156 1321107 1344122 1370702 1414666 1474246 1525494 1538929
326547 1499894 1439555 1402193 1363956 1356461 1367329 1372461 1382532 1389479 1381129 1375017 1350128 1342373 1339903
311058 1327487 1323077 1321626 1299370 1294719 1288309 1277325 1276633 1270425 1266505 1265390 1267341 1264093 1256991 1262142
294350 1252090 1251571 1254973 1273625 1268330 1264208 1271578 1261546 1261354 1275345 1275739 1278968 1284340 1287098 1279958 1278209
276399 1260172 1254675 1253618 1254281 1244306 1242701 1244402 1244700 1243019 1237061 1241298 1247410 1238983 1233515 1235062 1231314
$$ packed form
392874A335271K268p909Q130k806O525k8973N939K047J480m536m786k883J1638A312237
376740A317119l681o400N939p813J278r32j4712o948J1186K489M929m093P40l498A293287
359402A289318k883Q255L373N621j6586N478j461J2319j057K614R735N86k537A309969
343033A308710o727L873M930P30j547M190M997J951K3015K6580M3964N9580N1248A538929
326547A499894o0339l7362l8237p495J0868N132J0071O947q350o112k4889p755A339903
311058A327487m410j451k2256m651o410j0984o92o208l920j115J951l248p102A262142
294350A252090n19L402J8652n295m122P370j0032j92J3991L94L229N372K758p140A278209
276399A260172n497j057O63r975j605J701K98j681n958M237O112q427n468J547A231314
$$ plain form
258313 1234399 1223780 1228931 1230795 1228758 1229834 1224222 1236936 1240808 1251542 1256184 1255732 1260268 1245017 1246401
241234 1233957 1225010 1224981 1218725 1225721 1233015 1241049 1240165 1238262 1240386 1220724 1218476 1223482 1233140 1219465 1218331
222882 1231833 1262584 1279641 1314553 1368540 1419000 1497261 1565615 1622581 1685341 1758836 1793585 1743163
207870 1595741 1434155 1335396 1267956 1236071 1210596 1203571 1199900 1179278 1180931 1181988 1180268 1191520 1209952
191600 1195047 1180662 1179720 1157349 1161096 1153754 1146999 1146576 1138052 1146874 1144981 1164940 1167323 1177923 1179749
174048 1166535 1149661 1132805 1113961 1104053 1086650 1099441 1096731 1092195 1095472 1083498 1086900 1070814 1075666
157553 1067316 1060022 1067633 1075224 1056812 1046616 1047030 1034691 1030232 1035556 1020863 1025792 1030645 1026926 1027445
139759 1033067 1020180 1013867 1009725 1008591 1014414 1020574 1029684 1036882 1038679 1040601 1051075 1055169 1078597 1108829
$$ packed form
258313A234399j0619N151J864k037J076n612J2714L872J0734M642m52M536j5251A246401
241234A233957q947k9o256O996P294Q034q84j903K124j9662k248N006R658j3675A218331
222882A231833L0751J7057L4912N3987N0460P8261O8354N6966O2760P3495L4749A743163
207870A595741j61586r8759o7440l1885k5475p025l671k0622J653J057j720J1252A209952
191600A195047j4385r42k2371L747p342o755m23q524Q822j893J9959K383J0600A179749
174048A166535j6874j6856j8844r908j7403J2791k710m536L277j1974L402j6086A075666
157553A067316p294P611P591j8412j0196M14j2339m459N324j4693M929M853l719A027445
139759A033067j2887o313m142j134N823O160R110P198J797J922J0474M094K3428A108829
$$ plain form
121838 1147787 1144433 1097154 1053247 1007803 973285 952292 941376 939873 944284 951183 953943 966212 964540
104995 960818 933640 912055 900425 872409 881205 869428 853879 848903 846167 837987 832393 828943 821725
88040 807310 801913 806546 805905 807950 817338 818817 815195 809724 793585 805683 843161 899119 943126 942017
69748 940440 936990 947709
$$ packed form
121838A147787l354m7279m3907m5444l4518k0993j0916j503M411O899K760J2269I64540
104995I60818k7178k1585j1630k8016Q796j1777j5549m976k736q180n594l450H21725
88040H07310n397M633o41K045R388J479l622n471j6139J2098L7478N5958M4007I42017
69748I40440l450I47709
66073I42732  $$checkpoint
##END=
##TITLE= Raman spectrum of Glaucophane � http://rdrs.uaic.ro
##MINERAL= Glaucophane
##CHEMISTRY= []Na2(Mg3Al2)Si8O22(OH)2
##JCAMP-DX= 5.01
##DATA TYPE= RAMAN SPECTRUM
##DATA CLASS= XYDATA
##BLOCK_ID= 2
##ORIGIN= Department of Geology, UAIC, Romania
##OWNER= http://rdrs.uaic.ro � stud. Apopei Andrei Ionut
##LONGDATE= 2010/10/10 11:29:56.0951 +0200 $$ export date from JSpecView
##SPECTROGRAPHDATASYSTEM= HE 532 (Horiba Jobin-Yvon)
##XUNITS= Raman shift (1/cm)
##YUNITS= Intensity (cnt)
##XFACTOR= 3.188909E-3
##YFACTOR= 6.59406815E-4
##FIRSTX= 3399.61
##FIRSTY= 299.05331519
##LASTX= 210.701
##NPOINTS= 1024
##XYDATA= (X++(Y..Y))
$$ plain form
1066073 1876038 1899460 1904487 1911374 1905074 1897289 1917479 1917577 1917609 1915847 1912370 1913137 1928202 1919437 1912044 1927794
1053674 1914802 1918409 1903981 1927402 1925607 1933294 1934992 1932756 1946058 1955948 1945323 1931956 1921331 1929491
1042755 1942124 1959539 1937423 1948685 1952521 1944784 1952717 1949714 1945780 1947151 1960812 1963946 1951150 1966704
1031770 1964272 1955116 1954479 1970393 1974130 1994842 1955981 1969397 1970736 1946449 1966231 1974098 1975191 1968336
1020716 1981834 1992819 1994777 1969332 1985196 1970164 2005272 2014298 2014330 2007508 2008814 2003476 1992688 2019194 2005680
1008800 1998939 1995283 2013939 2009075 2009874 1999951 2008046 2002350 2012470 2005272 2026930 2031354 2028285 2028399 2029950
996808 2037360 2032529 2036054 2031827 2021789 2040151 2022458 2043040 2023323 2016534 2032986 2036478 2055069 2017105
985544 2035924 2047985 2045210 2071031 2065335 2073561 2075895 2055444 2049275 2059737 2070264 2076254 2067897 2092445
$$ packed form
1066073A876038K3422N027O887o300p785K0190R8L2j762l477P67J5065q765p393A927794
1053674A914802L607j4428K3421j795P687J698k236J3302R890j0625j3367j0625A929491
1042755A942124J7415k2116J1262L836p737P933l003l934J371J3661L134j2796A966704
1031770A964272r156o37J5914L737K0712l8861J3416J339k4287J9782P867J093A968336
1020716A981834J0985J958k5445J5864j5032L5108R026L2o822J306n338j0788K6506B005680
1008800A998939l656J8656m864P99r923Q095n696J0120p198K1658M424l069J14B029950
996808B037360m831L525m227j0038J8362j7693K0582j9717o789J6452L492J8591B017105
985544B035924J2061k775K5821n696Q226K334k0451o169J0462J0527N990q357B092445
$$ plain form
974211 2074524 2064894 2064274 2086324 2067799 2069203 2073920 2074997 2077853 2064160 2075389 2096215 2097047 2107330 2106906
961990 2078359 2088087 2099708 2100508 2098712 2119065 2130849 2112128 2093245 2088985 2084921 2101275 2111998 2107265
950516 2130588 2126083 2126916 2142405 2131943 2112504 2118788 2120697 2114397 2130017 2139875 2137606 2146567 2146567 2145082 2148134
937314 2146142 2154303 2135354 2127585 2151169 2167099 2157829 2177218 2168927 2160962 2145734 2155462 2154532 2151643 2159363
924852 2157094 2161256 2154907 2171783 2178655 2164520 2177855 2179014 2164863 2191973 2198534 2189149 2186407 2172322
913149 2182915 2180450 2192267 2192969 2192169 2196674 2197000 2192300 2200362 2195237 2188513 2194666 2205667 2215215 2215688 2202566
899687 2184008 2219654 2209029 2213060 2225922 2229774 2227913 2226020 2236482 2218626 2216716 2226950 2231814 2262547
887830 2249523 2240007 2245605 2237738 2246405 2242211 2243271 2230084 2247433 2253228 2244561 2248902 2258761 2269745 2275343
$$ packed form
974211B074524r630o20K2050j8525J404M717J077K856j3693J1229K0826Q32J0283B106906
961990B078359R728J1621Q00j796K0353J1784j8721j8883m260m064J6354J0723B107265
950516B130588m505Q33J5489j0462j9439O284J909o300J5620R858k269Q961%j485B148134
937314B146142Q161j8949p769K3584J5930r270J9389q291p965j5228R728r30k889B159363
924852B157094M162o349J6876O872j4135J3335J159j4151K7110O561r385k742B172322
913149B182915k465J1817P02q00M505L26m700Q062n125o724O153J1001R548M73B202566
899687B184008L5646j0625M031J2862L852j861j893J0462j7856j910J0234M864B262547
887830B249523r516N598p867Q667m194J060j3187J7349N795q667M341R859J0984B275343
$$ plain form
875045 2265681 2257259 2264848 2255888 2256720 2267052 2251791 2253799 2252591 2266725 2265420 2266252 2255121 2258385 2260752
862176 2260164 2269484 2269582 2255333 2245932 2263151 2279946 2275784 2266056 2287470 2280272 2283732 2275082 2273548 2256263
849218 2257324 2241966 2260197 2281741 2259364 2242896 2253489 2257259 2273140 2295092 2286132 2263918 2282214
837923 2280876 2284565 2300854 2272112 2277840 2287339 2288564 2293134 2286833 2276682 2270887 2271720 2277579 2291371 2281872
824809 2285609 2292628 2281382 2269745 2274380 2278771 2293803 2284043 2272650 2270643 2284679 2287796 2291763 2292203
812488 2287111 2288498 2266383 2295272 2291208 2277041 2276045 2300054 2303024 2301001 2298797 2301898 2293607 2291599 2291338
799204 2293525 2285707 2298699 2295468 2297801 2293329 2294097 2296137 2286246 2291273 2293558 2293901 2272079 2267182 2268945 2284043
784936 2289265 2289641 2298895 2299956 2300054 2300756 2300021 2297932 2306387 2294798 2309227 2291893 2279211 2292073 2313046 2300968
$$ packed form
875045B265681q422P589q960Q32J0332j5261K008j208J4134j305Q32j1131L264B260752
862176B260164R320R8j4249r401J7219J6795m162r728K1414p198L460q650j534B256263
849218B257324j5358J8231K1544k2377j6468J0593L770J5881K1952q960k2214B282214
837923B280876L689J6289k8742N728R499J225M570o301j0151n795Q33N859J3792B281872
824809B285609P019j1246j1637M635M391J5032r760j1393k007J4036L117L967B292203
812488B287111J387k2115K8889m064j4167r96K4009K970k023k204L101q291k008B291338
799204B293525p818J2992l231K333m472P68K040r891N027K285L43k1822m897J763B284043
784936B289265L76R254J061R8P02p35k089Q455j1589J4429j7334j2682J2862K0973B300968
$$ plain form
770568 2303857 2302894 2309324 2328812 2318481 2325107 2310728 2321517 2330412 2315951 2309749 2318742 2311691 2335210 2333497
757005 2347566 2342457 2329269 2342930 2346962 2347468 2344057 2354453 2357456 2341772 2347794 2345689 2355090 2371868 2373941
743351 2381808 2376210 2388663 2376765 2381531 2392858 2400529 2387537 2374741 2392433 2399386 2407253 2400725 2395224
730526 2411317 2410175 2409440 2393527 2419478 2398995 2384436 2406143 2407057 2421078 2402961 2408151 2405115 2391389
717622 2403385 2393788 2391487 2384958 2397885 2397052 2405246 2397852 2398995 2407922 2411121 2410012 2401149 2399223 2402128 2403450
702770 2394196 2393853 2405491 2407319 2401018 2404120 2408445 2395192 2398554 2400382 2412215 2411383 2397787 2404479 2410877
688753 2411578 2412884 2402324 2404348 2397428 2383995 2407319 2384240 2401051 2396122 2424831 2418238 2415675 2407057
675585 2396856 2419168 2414973 2432503 2423901 2422873 2429401 2432535 2432862 2421469 2406356 2436697 2414908 2422840
$$ packed form
770568B303857r63O430J9488j0331O626j4379J0789Q895j4461o202Q993p051K3519B333497
757005B347566n109j3188J3661M032N06l411J0396L003j5684O022k105R401J6778B373941
743351B381808n598J2453j1898M766J1327P671j2992j2796J7692O953P867o528B395224
730526B411317j142p35j5913K5951k0483j4559K1707R14J4021j8117N190l036B391389
717622B403385r597k301o529J2927q33Q194p394J143Q927L199j109q863j926K905B403450
702770B394196l43J1638J828o301L102M325j3253L362J828J1833q32j3596O692B410877
688753B411578J306j0560K024o920j3433K3324k3079J6811m929K8709o593k563B407057
675585B396856K2312m195J7530q602j028O528L134L27j1393j5113L0341k1789B422840
$$ plain form
662336 2423836 2430267 2420180 2426806 2422546 2421208 2432600 2425941 2436632 2435326 2430870 2436436 2428128 2448416 2428569
648046 2437366 2416475 2402194 2407922 2429597 2427231 2432503 2436501 2410975 2427133 2409587 2411986 2415316 2418303
634621 2409522 2390589 2409587 2415708 2388304 2390001 2391258 2398782 2409016 2407580 2419233 2410681 2383734 2386296
621112 2377532 2382608 2380976 2381841 2376667 2388190 2372048 2415218 2401214 2405523 2411986 2398652 2409440 2391862
607518 2415349 2414043 2397917 2395926 2391797 2396530 2412411 2415904 2422073 2418450 2415969 2424897 2413717 2434690 2433302
592858 2436534 2433825 2419935 2421045 2425207 2439292 2412443 2438656 2418972 2419739 2409555 2419609 2409440 2436093
579082 2418939 2433629 2448351 2443389 2432731 2425501 2412852 2415904 2424978 2401655 2398897 2402292 2403450 2400121
565222 2410240 2400921 2393560 2401018 2388157 2373011 2374708 2387357 2386427 2378005 2378838 2359317 2358044 2382167 2370938
$$ packed form
662336B423836O431j0087O626m260j338J1392o659J0691j306m456N566q308K0288B428569
648046B437366k0891j4281N728K1675k366N272L998k5526J6158j7546K399L330B418303
634621B409522j8933J8998O121k7404J697J257P524J0234j436J1653q552k6947B386296
621112B377532N076j632Q65n174J1523j6142M3170j4004M309O463j3334J0788B391862
607518B415349j306j6126j991m129M733J5881L493O169l623k481Q928j1180K0973B433302
592858B436534k709j3890J110M162J4085k6849K6213j9684P67j0184J0054j0169B436093
579082B418939J4690J4722m962j0658p230j2649L052R074k3323k758L395J158B400121
565222B410240r319p361P458j2861j5146J697J2649r30q422Q33j9521j273K4123B370938
$$ plain form
550273 2362157 2382836 2364883 2373533 2365846 2356249 2363087 2367510 2349230 2350895 2365340 2365487 2367543 2360182 2365748
535221 2365487 2366515 2370171 2381971 2389626 2384305 2409653 2399321 2383538 2367005 2377336 2393919 2386966 2377108
521081 2378266 2368441 2368914 2361210 2372342 2363610 2363822 2357293 2360084 2353458 2348757 2349492 2331375 2345264 2352919 2354355
504809 2330869 2326739 2323377 2325303 2317077 2310793 2310549 2320847 2304754 2299401 2306125 2298601 2303253 2290261 2290702
489446 2268847 2294635 2291436 2292464 2296104 2270153 2252722 2273744 2270855 2271475 2273254 2278885 2268553 2276518 2274674
473977 2279472 2275980 2281007 2283634 2258858 2274217 2284614 2285267 2283210 2279570 2276208 2274919 2280615 2284614 2291061
458401 2275049 2275914 2262253 2264114 2270381 2272389 2268488 2275180 2259495 2273874 2286833 2256655 2252134 2253064 2250959
442719 2226689 2250437 2244365 2238342 2235878 2256296 2227913 2234376 2218561 2229284 2212718 2209258 2210367 2193866
$$ packed form
550273B362157K0679j7953Q650p687r597O838M423j8280J665J4445J47K056p361B365748
535221B365487J028L656J1800P655n321K5348j0332j5783j6533J0331J6583o953B377108
521081B378266r825M73p704J1132q732K12o529K791o626m701P35j8117J3889P655B354355
504809B330869m130l362J926q226o284k44J0298j6093n353O724p524M652j2992B290702
489446B268847K5788l199J028L640k5951j7431K1022k889O20J779N631j0332P965B274674
473977B279472l492N027K627k4776J5359J0397O53k057l640l362j289N696L999B291061
458401B275049Q65j3661J861O267K008l901O692j5685J4379J2959l0178m521R30B250959
442719B226689K3748o072o023k464K0418k8383O463j5815J0723j6566l460J109B193866
$$ plain form
427986 2198632 2208458 2209698 2209535 2199399 2186636 2185477 2191940 2185983 2185950 2186848 2179716 2180711 2184971 2195009 2191141
411028 2190145 2193768 2190374 2185771 2184416 2183274 2197833 2196674 2195303 2189476 2194503 2192512 2222151 2211787 2213664
395019 2206303 2196772 2218626 2200738 2209388 2191712 2209486 2196510 2182980 2179079 2178279 2187109 2169890 2156866
379973 2156866 2176158 2164031 2158171 2179046 2160228 2177382 2171424 2164831 2147203 2155674 2152475 2132677 2137508
364833 2151365 2148901 2146044 2138406 2148705 2133151 2144739 2121317 2143417 2151577 2134979 2138080 2140103 2165532
349593 2167393 2159363 2168062 2160097 2155136 2155299 2172746 2159232 2139744 2166495 2152100 2170527 2178524 2161468
334255 2182539 2213354 2226852 2295859 2364214 2450652 2453916 2399027 2311626 2258124 2229382 2210824 2216096
319921 2241574 2248266 2249229 2245834 2247401 2220813 2214431 2192300 2180042 2162594 2153438 2139614 2126181 2119653
$$ packed form
427986B198632R826J240j63j0136j2763j159O463n957l3Q98p132R95M260J0038B191141
411028B190145L623l394m603j355j142J4559j159j371n827N027j991K9639j0364B213664
395019B206303r531K1854j7888Q650j7676J7774j2976j3530l901q00Q830j7219B156866
379973B156866J9292j2127n860K0875j8818J7154n958o593j7628Q471l199j9798B137508
364833B151365k464k857p638J0299j5554J1588k3422K2100Q160j6598L101K023B165532
349593B167393q030Q699p965m961J63J7447j3514j9488K6751j4395J8427P997B161468
334255B182539L0815J3498O9007O8355Q6438L264n4889q7401n3502k8742j8558B216096
319921B241574O692R63l395J567k6588o382k2131j2258j7448r156j3824j3433B119653
$$ plain form
304389 2105975 2107428 2101079 2104506 2092184 2092951 2072892 2083778 2078115 2064862 2075422 2093440 2099610 2093342
288755 2073365 2091188 2084692 2097635 2087450 2096378 2102270 2112765 2118429 2116927 2095709 2087320 2070035 2070297
273018 2077119 2082554 2060471 2059867 2063801 2045080 2069432 2058431 2060406 2037311 2052669 2048312 2044917 2049275
257178 2048344 2053143 2052882 2061842 2047479 2033296 2039318 2046010 2071129 2064535 2063833 2073430 2076319 2063474 2069399
240091 2031288 2040347 2047414 2047071 2054840 2066200 2074165 2073185 2062299 2042974 2023764 2032463 2037246 2039922 2037115
222882 2050172 2061760 2120061 2162121 2218087 2304297 2400757 2481989 2561197 2657298 2753236 2814817 2720854
207870 2550278 2320472 2189182 2098582 2053534 2013808 2021626 1994157 1990615 1982259 1997748 1975371 2004978
192766 2014102 2033263 2013204 1997144 1986518 1981557 1962771 1958348 1953778 1959017 1975828 1984397 1997846 1999184
$$ packed form
304389B105975J453o349L427j2322P67k0059J0886n663j3253J0560J8018O170B093342
288755B073365J7823o496J2943j0185Q928N892J0495N664j502k1218q389j7285B070297
273018B077119N435k2083o04L934j8721K4352j1001J975k3095J5358m357l395B049275
257178B048344M799k61Q960j4363j4183O022O692K5119o594p02R597K889j2845B069399
240091B031288R059P067l43P769J1360P965r80j0886j9325j9210Q699M783K676B037115
222882B050172J1588N8301M2060N5966Q6210R6460Q1232P9208R6101R5938O1581B720854
207870B550278k29806j31290r0600m5048l9726P818k7469l542q356J5489k2377B004978
192766B014102J9161k0059j6060j0626m961j8786m423m570N239J6811Q569J3449A999184
$$ plain form
176395 2014461 2020467 2010331 1982993 1937587 1922734 1934665 1942695 1920906 1915634 1923273 1907849 1900015 1900521
159917 1885423 1889324 1900553 1890728 1890858 1894792 1876936 1878568 1873166 1853890 1862410 1861153 1835267 1848488 1860207
142139 1872138 1879303 1873313 1867943 1857089 1857024 1851589 1850251 1870669 1895592 1932527 1935955 1946515 1938729 1953810
124234 1971894 2027518 2080987 2072728 2023797 1951182 1894351 1851458 1818211 1837895 1833766 1848684 1873704
108614 1879662 1884966 1877034 1874765 1856812 1823679 1814817 1826503 1832966 1816645 1860321 1897485 1953647 1987188
91683 2025396 2031517 2045912 2028465 1989979 1971242 1971992 1957075 1962869 1959409 1950807 1956748 1950252 1948081 1997111
73416 2074589 2138879 2163198 2163296 2168960 2185347
$$ packed form
176395B014461O006j0136k7338m5406j4853J1931Q030k1789n272P639j5424p834A900521
159917A885423L901J1229r825J30L934j7856J632n402j9276Q520j257k5886J3221A860207
142139A872138P165n990n370j0854o5n435j338K0418K4923L6935L428J0560p786A953810
124234A971894N5624N3469q259m8931p2615n6831m2893l3247J9684m129J4918A873704
108614A879662N304p932k269j7953l3133q862J1686O463j6321M3676L7164N6162A987188
91683B025396O121J4395j7447l8486j8737P50j4917N794l460q602N941o496k171A997111
73416B074589O4290K4319R8N664B185347
66073B205471  $$checkpoint
##END=
##TITLE= Raman spectrum of Glaucophane � http://rdrs.uaic.ro
##MINERAL= Glaucophane
##CHEMISTRY= []Na2(Mg3Al2)Si8O22(OH)2
##JCAMP-DX= 5.01
##DATA TYPE= RAMAN SPECTRUM
##DATA CLASS= XYDATA
##BLOCK_ID= 3
##ORIGIN= Department of Geology, UAIC, Romania
##OWNER= http://rdrs.uaic.ro � stud. Apopei Andrei Ionut
##LONGDATE= 2010/10/10 11:30:20.0945 +0200 $$ export date from JSpecView
##SPECTROGRAPHDATASYSTEM= HE 532 (Horiba Jobin-Yvon)
##XUNITS= Raman shift (1/cm)
##YUNITS= Intensity (cnt)
##XFACTOR= 3.188909E-3
##YFACTOR= 1.00415189E-3
##FIRSTX= 3399.61
##FIRSTY= 2344.26546853
##LASTX= 210.701
##NPOINTS= 1024
##XYDATA= (X++(Y..Y))
$$ plain form
1066073 1579532 1594726 1599790 1599848 1596966 1597569 1612683 1608205 1608106 1615488 1622618 1612880 1614535 1615430 1610755 1613269 1607835
1052896 1604835 1612138 1622521 1626318 1631539 1619150 1617846 1620826 1633741 1633155 1627390 1627176 1616696 1624274 1621605
1041190 1640129 1638746 1629027 1631520 1637363 1636058 1637051 1639641 1639038 1661302 1651134 1648173 1660737 1654270 1652926
1029405 1656996 1656939 1659295 1657035 1662995 1652828 1648426 1651096 1659587 1663717 1662392 1663405 1673378 1669131 1667728 1664729
1016755 1678150 1681928 1694785 1683467 1686857 1688786 1684188 1678287 1688980 1683779 1671760 1670749 1682144 1677624
1005610 1682377 1694746 1682435 1694900 1678501 1688901 1693577 1689682 1694453 1689389 1707171 1706705 1707796 1703276
994400 1704640 1708302 1697335 1703101 1699674 1709568 1692681 1711263 1716794 1706199 1701893 1710502 1716443 1728657 1733604
982311 1720261 1740109 1730858 1734694 1723280 1729300 1733351 1727585 1733817 1740226 1740928 1730020 1738356 1731286 1739076
$$ packed form
1066073A579532J5194N064N8k882O03J5114m478r9P382P130r738J655Q95m675K514A607835
1052896A604835P303J0383L797N221j2389j304K980J2915n86n765k14j0480P578A621605
1041190A640129j383r719K493N843j305R93K590o03K2264j0168k961J2564o467A652926
1029405A656996n7K356k260N960j0167m402K670Q491M130j325J013R973m247j403A664729
1016755A678150L778J2857j1318L390J929m598n901J0693n201j2019j011J1395A677624
1005610A682377J2369j2311J2465j6399J0400M676l895M771n064J7782m66J091A703276
994400A704640L662j0967N766l427R894j6887J8582N531j0595m306Q609N941J2214A733604
982311A720261J9848r251L836j1414O020M051n766O232O409P02j0908Q336p070A739076
$$ plain form
970147 1733428 1747589 1744628 1746439 1745680 1738046 1745738 1745680 1750413 1761122 1753444 1764015 1754601 1760719 1762315 1776479
957083 1780791 1763542 1749575 1742661 1766399 1766469 1767468 1774971 1787576 1789837 1773867 1786349 1772254 1771623 1767854
944753 1769292 1777952 1782615 1786980 1785314 1782404 1785454 1788154 1794412 1797585 1792169 1785051 1781966 1783999 1796656 1793168
931510 1796867 1794798 1792449 1786980 1791380 1787681 1779967 1792256 1797954 1793220 1801056 1811452 1812609 1806158 1815642
919010 1822128 1816869 1823898 1814870 1829403 1816448 1806140 1814274 1826265 1818218 1820848 1824424 1827843 1836660 1828386
906429 1844952 1844461 1831331 1840745 1845706 1840657 1848160 1833522 1834066 1824196 1831699 1842042 1858415 1863622 1873404
893766 1856925 1868092 1857574 1856312 1850877 1854927 1875437 1868846 1864393 1861431 1869354 1861711 1859257 1858573 1859485
881022 1868302 1866216 1868951 1865585 1877962 1885482 1893826 1882239 1879820 1885622 1887288 1882099 1885482 1891705 1873036
$$ packed form
970147A733428J4161k961J811p59p634P692n8M733J0709p678J0571r414O118J596A776479
957083A780791j7249j3967o914K3738P0R99P503J2605K261j5970J2482j4095o31A767854
944753A769292Q660M663M365j666k910L050K700O258L173n416p118l085K033J2657A793168
931510A796867k069k349n469M400l699p714J2289N698m734P836J0396J157o451A815642
919010A822128n259P029r028J4533j2955j0308Q134J1991q047K630L576L419Q817A828386
906429A844952m91j3130R414M961n049P503j4638N44r870P503J0343J6373N207A873404
893766A856925J1167j0518j262n435M050K0510o591m453k962P923p643k454o84A859485
881022A868302k086K735l366J2377P520Q344j1587k419N802J666n189L383O223A873036
$$ plain form
868190 1886464 1876559 1881801 1874210 1883589 1873334 1883466 1882607 1894598 1885955 1887726 1883238 1886411 1893476 1888918
855277 1893686 1906729 1906133 1903784 1892003 1891355 1895176 1881240 1873754 1893581 1896456 1905817 1889794 1876366 1879715
842276 1884132 1906799 1905852 1892003 1902907 1902749 1901049 1908131 1897420 1909674 1909358 1904502 1911602 1896438 1896386
829190 1891810 1887866 1906974 1910778 1904239 1912847 1905887 1905817 1910129 1904432 1910761 1902662 1893441 1904660 1894633 1902837
815135 1912408 1908464 1918860 1909411 1906816 1906623 1912040 1912338 1908885 1906238 1915879 1927660 1923645 1928168 1920069 1908096
800979 1921086 1912163 1906939 1914424 1913232 1928624 1916896 1909498 1915739 1914863 1908289 1913127 1918579 1912198 1907342
787620 1890951 1896018 1905484 1912145 1920946 1917948 1926380 1927940 1926923 1927730 1931324 1937336 1928449 1933795 1918982 1914775
773271 1924539 1924837 1919403 1921331 1930850 1939861 1944226 1948784 1949169 1947188 1947907 1945698 1936495 1936723 1929395 1938528 1939247
$$ packed form
868190A886464r905N242p591R379j0255J0132q59J1991q643J771m488L173P065A888918
855277A893686J3043n96k349j1781o48L821j3936p486J9827K875R361j6023j3428A879715
842276A884132K2667r47j3849J0904j58j700P082j0711J2254l16m856P100j5164A896386
829190A891810l944J9108L804o539Q608o960p0M312n697O329q099r221J1219j0027A902837
815135A912408l944J0396r449k595j93N417K98l453k647R641J1781m015M523q099A908096
800979A921086q923n224P485j192J5392j1728p398O241q76o574M838N452o381A907342
787620A890951N067R466O661Q801k998Q432J560j017Q07L594O012q887N346j4813A914775
773271A924539K98n434J928R519R011M365M558L85j981P19k209r203K28p328R133A939247
$$ plain form
757911 1953692 1966963 1964719 1962037 1963579 1964088 1961739 1970942 1970206 1969890 1970802 1969452 1968067 1978795 1977358 1988209
743351 1984212 1994082 1993573 1993188 1998973 2004425 2012173 2008071 2000375 2018221 2024199 2025566 2015626 2016608 2028353 2023568
728688 2025829 2019799 2014505 2006108 2012261 2015276 2013207 2024076 2028879 2024164 2022218 2007352 2019799 2006616 2018063
714843 2009140 2016994 2024339 2020132 2021341 2029651 2032210 2026478 2022007 2009123 2011349 2025969 2034156 2038135 2021587
700907 2020114 2028459 2024707 2030299 2016976 2014627 2014277 2024357 2034682 2030755 2037241 2029318 2033735 2027968 2032228
686878 2022411 2033910 2032087 2015258 2018992 2021131 2026390 2029703 2033437 2033893 2040344 2047391 2038451 2029265 2046112
672754 2043254 2044919 2045235 2052843 2055385 2064711 2047374 2051423 2047882 2056226 2054070 2054509 2057506 2047128 2062818 2056104
657582 2049845 2062117 2058400 2055999 2040888 2045025 2048636 2054298 2064606 2060486 2050740 2041221 2020903 2038538 2054193
$$ packed form
757911A953692J3271k244k682J542N09k349R203p36l16R12j350j385J0728j437A988209
743351A984212R870n09l85N785N452P748m102p696J7846N978J367r940R82J1745B023568
728688B025829o030n294q397O153L015k069J0869M803m715j946j4866J2447j3183B018063
714843B009140P854P345m207J209Q310K559n732m471j2884K226J4620Q187L979B021587
700907B020114Q345l752N592j3323k349l50J0080J0325l927O486p923M417n767B032228
686878B022411J1499j823j6829L734K139N259L313L734M56O451P047q940r186B046112
672754B043254J665L16P608K542R326j7337M049l541Q344k156M39K997j0378J5690B056104
657582B049845J2272l717k401j5111M137L611N662J0308m120r746r519k0318J7635B054193
$$ plain form
643261 2068252 2066114 2044148 2042132 2045323 2044534 2038188 2031877 2043517 2038205 2040484 2028003 2032666 2034699 2029668
628842 2022288 2029125 2035997 2031298 2031421 2022744 2029879 2020500 2009508 2018729 2023673 2026793 2016468 2029475 2035067
614326 2039520 2039853 2033034 2034717 2029984 2040309 2036347 2032771 2036663 2042395 2049863 2029107 2042220 2056016 2055490
599710 2041431 2047041 2048022 2059803 2055297 2076001 2076439 2072845 2070338 2055928 2061398 2055841 2061450 2071162 2069725
584996 2060574 2051283 2047654 2056069 2049810 2055525 2059294 2058067 2062204 2067796 2055192 2052247 2058856 2060960 2044008
570182 2035769 2035015 2041168 2039941 2035821 2025654 2034752 2026215 2024023 2025952 2019185 2026110 2022007 2032736 2017257
555268 2019168 2001322 2023217 2021552 2017450 2016573 2015486 2006967 2012944 2014434 2011121 2011296 1996045 2005178 2005161
540251 2012681 2008825 2002864 2002479 2014101 2012418 2017327 2017502 2032140 2027740 2031439 2032578 2027705 2026811 2007808 2027126
$$ packed form
643261B068252k138k1966k016L191p89o346o311J1640n312K279j2481M663K033B029668
628842B022288O837O872m699J23q677P135r379j0992R221M944L120j0325J3007B035067
614326B039520L33o819J683m733J0325l962l576L892N732P468k0756J3113J3796B055490
599710B041431N610R81J1781m506K0704M38l594k507j4410N470n557N609R712B069725
584996B060574r291l629Q415o259N715L769j227M137N592j2604k945O609K104B044008
570182B035769p54O153j227m120j0167R098q537k192J929o767O925m103J0729B017257
555268B019168j7846K1895j665m102q77j087q519N977J490l313J75j5251R133B005161
540251B012681l856n961l85J1622j683M909J75J4638m400L699J139m873q94j9003B027126
$$ plain form
524120 2024953 2019623 2018957 2013908 2006020 2020570 2014943 2017765 2006476 2018309 2006020 2004021 2002286 1996624 1992977
508889 2005932 1997500 2000550 1995607 1993556 1986123 1979356 1972362 1959337 1960546 1966209 1967523 1959880 1954288 1958127
493554 1951361 1948889 1940755 1939896 1940019 1941070 1948258 1948696 1942210 1922173 1922997 1927257 1943928 1920262 1927239 1933532
477079 1934917 1936600 1933375 1935022 1919140 1925942 1927958 1923628 1932410 1942175 1934076 1938634 1937564 1937073 1931429 1937424
460487 1936109 1934409 1923873 1926555 1921033 1917475 1911549 1928712 1915178 1914232 1915809 1924154 1922997 1921419 1912899
444817 1905239 1900207 1892564 1901084 1907465 1893616 1893791 1887200 1884886 1885500 1884903 1881012 1870827 1864814 1861518 1866795
427986 1852245 1872895 1851736 1850211 1848493 1846845 1847652 1852455 1865953 1856224 1846705 1846688 1852928 1863429 1856627
412091 1859783 1854068 1852928 1845162 1845268 1843269 1852227 1852315 1851403 1850825 1860414 1852613 1842813 1856697 1850141 1860624 1852192
$$ packed form
524120B024953n330o66n049p888J4550n627K822j1289J1833j2289j999j735n662A992977
508889B005932q432L050m943k051p433o767o994j3025J209N663J314p643n592A958127
493554A951361k472q134q59J23J051P188M38o486k0037Q24M260J6671k3666O977A933532
477079A934917J683l225J647j5882O802K016m330Q782R765q099M558j070m91n644A937424
460487A936109j700j0536K682n522l558n926J7163j3534r46J577Q345j157j578A912899
444817A905239n032p643Q520O381j3849J75o591k314O14n97l891j0185o013l296A866795
427986A852245K0650k1159j525j718j648Q07M803J3498r729r519j7O240J0501A856627
412091A859783n715j140p766J06j999Q958Q8r12n78R589p801r800J3884o556J0483A852192
$$ plain form
393947 1850036 1846933 1848984 1855418 1849019 1863534 1842480 1838974 1824301 1836485 1834925 1835556 1815431 1819761 1822619
377819 1827983 1814590 1810943 1818727 1817044 1809523 1820129 1797130 1801758 1799689 1797515 1791818 1793028 1797883 1782229
361575 1794114 1791345 1770852 1779021 1778600 1786366 1788820 1784350 1791713 1785875 1798567 1800250 1791941 1813292 1794675
345222 1788785 1809225 1802792 1787839 1806473 1801705 1786664 1793115 1793483 1798707 1810453 1816325 1851543 1884728
329853 1948293 2009649 2026898 1984808 1921664 1867478 1840254 1828298 1837449 1840517 1846460 1849598 1862780 1851964
314387 1833908 1815203 1802231 1785086 1780686 1767802 1762420 1760947 1758055 1746323 1737792 1731870 1734773 1728851
298818 1721546 1721625 1718508 1714145 1704952 1710639 1712236 1724586 1717749 1721080 1712879 1704114 1718314 1717807 1726553 1721781
280900 1744006 1747025 1731286 1725540 1710288 1699693 1699050 1707640 1703413 1703413 1707971 1688376 1680741 1693635 1678637
$$ packed form
393947A850036l103K051O434o399J4515k1054l506j4673J2184j560O31k0125M330A822619
377819A827983j3393l647P784j683p521J0606k2999M628k069k174n697J210M855A782229
361575A794114k769k0493Q169m21P766K454m470P363n838J2692J683q309K1351A794675
345222A788785K0440o433j4953J8634m768j5041O451L68N224J1746N872L5218A884728
329853A948293O1356J7249m2090o3144n4186k7224j1956R151L068N943L138J3182A851964
314387A833908j8705j2972j7145m400j2884n382j473k892j1732q531n922K903A728851
298818A721546P9l117m363r193N687J597J2350o837L331q201q765J4200n07Q746A721781
280900A744006L019j5739n746j5252j0595o43Q590m227%M558j9595p635J2894A678637
$$ plain form
263979 1677819 1673631 1682552 1668139 1674937 1670709 1668470 1677877 1676124 1678033 1664184 1661184 1673513 1675677 1675617
246940 1687772 1688142 1696499 1677896 1681462 1670125 1660269 1656958 1655068 1664378 1659840 1678793 1680525 1678403 1669229
229780 1654777 1654270 1642466 1641980 1645933 1649322 1659470 1656179 1696148 1743245 1790749 1845250 1932603 2003723
213655 2039836 2117600 2201973 2240206 2188299 2042500 1874491 1756039 1687441 1646771 1624234 1616696
199749 1593868 1587791 1596848 1587675 1588083 1599360 1610717 1609412 1600472 1587908 1583038 1569559 1560969 1554990 1551133
182254 1552322 1546090 1568644 1565762 1577001 1585708 1584695 1567126 1551407 1527390 1518061 1499517 1493751 1488394
165815 1496537 1491395 1484168 1477897 1466443 1465898 1465547 1460386 1458302 1457483 1451737 1452497 1445913 1441588 1439096 1421585
146892 1416832 1407541 1416366 1416988 1415372 1426903 1423864 1420514 1407990 1401269 1398269 1397666 1408321 1420883 1437986
$$ packed form
263979A677819m188Q921j4413O798m228k239R407j753J909j3849l000J2329K164A675617
246940A687772L70Q357j8603L566j1337r856l311j890R310m538J8953J732k122A669229
229780A654777n07j1804m86L953L389J0148l291L9969M7097M7504N4501Q7353B003723
213655B039836P7764Q4373L8233n1907j45799j68009j18452o8598m0670k2537A616696
199749A593868o077R057r173M08J1277J1357j305q940j2564m870j3479q590n979A551133
182254A552322o232K2554k882J1239Q707j013j7569j5719k4017r329j8544n766A488394
165815A496537n142p227o271j1454n45l51n161k084q19n746P60o584m325k492A421585
146892A416832r291Q825O22j616J1531l039l350j2524o721l000o03J0655J2562A437986
$$ plain form
129022 1442076 1442544 1440147 1444998 1475169 1501971 1535610 1529415 1495115 1443653 1391939 1348075 1326436 1320377
112227 1320630 1332882 1337752 1348757 1363228 1360269 1355438 1332435 1312040 1285766 1280817 1271720 1271720 1273240 1273202
94108 1290732 1292427 1296166 1293614 1289075 1272169 1258904 1256411 1255146 1249574 1264650 1253119 1253976 1243595 1240206
75859 1253138 1270123 1321566 1371702 1379824 1384012 1377312 1377507
$$ packed form
129022A442076M68k397M851L0171K6802L3639o195l4300n1462n1714m3864k1639A320377
112227A320630J2252M870J1005J4471k959m831k3003k0395k6274m949r097%J520A273202
94108A290732J695L739k552m539j6906j3265k493j265n572J5076j1531Q57j0381A240206
75859A253138J6985N1443N0136Q122M188o700A377507
66073A393810  $$checkpoint
##END=
##END=   $$end of all blocks