##TITLE= Raman spectrum of Goethite � http://rdrs.uaic.ro
##MINERAL= Goethite
##CHEMISTRY= Fe+++O(OH) 
##JCAMP-DX= 5.01
##DATA TYPE= RAMAN SPECTRUM
##DATA CLASS= XYDATA
##ORIGIN= Department of Geology, UAIC, Romania
##OWNER= http://rdrs.uaic.ro � stud. Apopei Andrei Ionut
##LONGDATE= 2010/06/01 13:44:04.0659 +0300 $$ export date from JSpecView
##SPECTROGRAPHDATASYSTEM= HE 532 (Horiba Jobin-Yvon)
##XUNITS= Raman shift (1/cm)
##YUNITS= Intensity (cnt)
##XFACTOR= 3.188909E-3
##YFACTOR= 1.80255212E-4
##FIRSTX= 3399.61
##FIRSTY= 0.37890372
##LASTX= 210.701
##NPOINTS= 1024
##XYDATA= (X++(Y..Y))
1066073B102%%%%%%%%%%%%J856j95J95l990j064K902P72p95J327K322l09k564j806B45
$$ 2102 2102 2102 2102 2102 2102 2102 2102 2102 2102 2102 2102 2102 3958 3763 3958 -32 -1096 1806 2578 1783 3110 5432 5123 2559 753 245
1045100i3M00J821J338r19j419N93J717O43J71J127M37k560l670o84K283J200j530f91
$$ -93 307 2128 3466 2547 1128 1721 3438 4081 4252 5379 5816 3256 -414 -1098 1185 2385 855 -691
1030196b98O47p62q54P27J621J378J775K738J965r70l458l416j439R48K776L047G545
$$ -298 349 -413 -1267 -540 1081 2459 4234 6972 8937 7967 4509 1093 -346 602 3378 6425 7545
1015959E848k622j454L33J430J908J961J304L81K97J119J743J689J325M15j417A1633
$$ 5848 3226 1772 2105 3535 5443 7404 8708 9089 9386 10505 12248 13937 15262 15677 14260 11633
1002415A0703K752M336K082o46k56J760J295j993m159k590Q09K725K368J110lp51A8950
$$ 10703 13455 17791 19873 19227 18971 20731 22026 20033 15874 13284 14093 16818 19186 20296 20293 19542 18950
987962B0061L497M178J898j356k264l47J271J80j820j405J196K519J021r69j218B5817
$$ 20061 23558 27736 29634 28278 26014 25667 26938 27118 25298 23893 25089 27608 28629 27660 26442 25817
974211B4965j471j359q98p43k28Q52Q22r70j810O28L738K949j581n144n064l123A0250
$$ 24965 23494 22135 21237 20494 20266 21118 21940 20970 19160 19788 23526 26475 24894 19750 14686 11563 10250
959538A0814K159J662p67k283j871j920l336l120K54K902R90k902l425m10J644A210
$$ 10814 12973 14635 13868 11585 9714 7794 4458 1338 1592 4494 5484 2582 -843 -1253 391 1210
945574I07K68J463J815J621Q43r02k254j265R91J350n15j716j120p10j196p15c74
$$ 907 1175 2638 4453 6074 6917 6015 3761 2496 3487 4837 4322 2606 1486 776 -420 -1135 -374
930679B6j971k116J801N234L965N79k66O73n55k472j409J484J770l66n71J441H457
$$ 26 -1945 -4061 -2260 2974 6939 7518 7252 7925 7370 4898 3489 4973 6743 6377 5806 7247 8457
915664F535k870K36K185n64l609j913R82J838L01M68J890R27j704j661J189K135E763
$$ 6535 3665 3901 6086 5522 1913 0 982 2820 3121 3589 5479 6406 4702 3041 4230 6365 5763
900531C498k205r50j59J211L191L171O48q28N41J308j319m112k895L30P25j243@
$$ 3498 1293 343 184 1395 4586 7757 8405 7577 8118 9426 8107 3995 1100 1430 2155 912 0
885278A756L335J353o11K4P58p69k040j13K560J511k341l577l37L033K486l70E167
$$ 1756 5091 6444 5833 5857 6615 5846 3806 3693 6253 7764 5423 1846 1509 4542 7028 6658 5167
869906D993J086R46M16K06m30j693k219j163K98P16M51O12R42M51m76n46J03K6C801
$$ 4993 6079 7025 7441 7647 7217 5524 3305 2142 2440 3156 3607 4219 5161 5612 5136 4590 4693 4719 3801
852683B595l79J31k02J74J714J936p13l362k397P27J300j476l344j645J020J473a843
$$ 2595 2216 2347 2145 2319 4033 5969 5256 1894 -503 224 1524 48 -3296 -4941 -3921 -2448 -1843
837051a054J601J178j85q88r95j375j068J228L760L242k05k795k322p03l25n56a021
$$ -1054 547 1725 1540 652 -343 -1718 -2786 -1558 2202 5444 5239 2444 122 -581 -906 -1462 -1021
821297A293K847R05k188l893k711K83K246J758M32L27R22K05j162m86K101L094F927
$$ 1293 4140 5045 2857 -1036 -3747 -3464 -1218 540 972 1299 2221 2426 1264 778 2879 5973 6927
805413E389k016j925k764k529M61L279K330o14j112O45M80k325l736j796N24Q05d278
$$ 5389 3373 1448 -1316 -3845 -3384 -105 2225 1611 499 1144 1624 -701 -4437 -6233 -5709 -4904 -4278
789405b870J361m99j399N92K456O99k782l522j122J172J993K560K914J882L44D002
$$ -2870 -1509 -2008 -3407 -2815 -359 340 -2442 -5964 -7086 -5914 -3921 -1361 1553 3435 3779 4002
774171D436j931n110m759l48K984K019j7O71K332J344j319j848R5J283K59j206b758
$$ 4436 2505 -2605 -7364 -7712 -4728 -2709 -2726 -2055 277 1621 302 -1546 -1451 -168 91 -1115 -2758
757911d195r17M7N64k88j121J08K264K212P0n46J550K917J098j361j229J59l26e60
$$ -4195 -5112 -5065 -4501 -4789 -5910 -5802 -3538 -1326 -1256 -1802 -252 2665 3763 2402 1173 1332 1006 -560
740611a101J944K052n62j781K83K153R35m72K001O231N971o1n774n733j882L15D183
$$ -1101 843 2895 2333 552 835 2988 3923 3451 5452 11683 17654 17593 11819 6086 4204 4519 4183
724085C620J040J782k25k586k284j92O87J61P83K716L009L24k562k577l70J384F502
$$ 3620 4660 6442 6217 3631 1347 1155 1842 2003 2786 5502 8511 8835 6273 3696 3326 4710 6502
707424H130Q91r15k659k232M67L053L444J825k00j170o41L29p9j910k571m50J716G220
$$ 8130 9021 8106 5447 3215 3682 6735 10179 12004 11804 10634 9993 10322 10243 8333 5762 5312 7028 7220
689690C712l712l16M058L116n38j363O90J034j613l315j488J278K429q0j857j714d55
$$ 3712 0 -316 3742 6858 6320 4957 5647 6681 5068 1753 265 1543 3972 3892 2035 321 -455
672754e06K96J44l49k87Q20J974J955J093M45J72m71j547j754l70J557K211Q47D775
$$ -506 -210 -66 -415 -702 118 2092 4047 5140 5585 5757 5286 3739 1985 1615 3172 5383 6230 4775
654725B138j527R07K472K073O30m17o30k99J98J41j238l194l392p72K484L355D536
$$ 2138 611 1518 3990 6063 6693 6276 5646 5347 5545 5686 4448 1254 -2138 -2910 -426 2929 4536
637503C924j940k491k054r2K359L104J779M01L05N21l7q21j096j110p54Q32K886H360
$$ 3924 1984 -507 -2561 -2653 -294 2810 4589 4990 5295 5816 5779 4958 3862 2752 1998 2830 5716 8360
619174G795l065j515J898K276r38l479k635l37M45Q97J799K408J597J51o29j090C614
$$ 7795 4730 3215 5113 7389 6451 2972 337 0 445 1342 3141 5549 7146 7297 6668 5578 3614
601667A367n99J910K639Q06j665k654j828k04J002J119N93O38J472J552k25k295A465
$$ 1367 768 2678 5317 6123 4458 1804 -24 -228 774 1893 2486 3124 4596 6148 5923 3628 1465
584012A520J754J522R82P29L11r22j834r46J098K156J236o60j950j851p22J46B093
$$ 1520 3274 4796 5778 6507 6818 5896 4062 3116 4214 6370 7606 6946 4996 3145 2423 2569 2093
566216e0k668o56K381L591K268M31r4K21Op40r01l00j64j156j863l06K341M295H991
$$ -50 -2718 -3374 -993 2598 4866 5297 5203 5424 5430 4690 3789 3489 3325 2169 306 0 2341 6636 8991
546268G134m112k424Q42K204J073m66q44m25p1K09Q94K031K995K854J290m74l86A4222
$$ 7134 3022 598 1440 3644 4717 4251 3407 2982 2911 3120 4014 6045 9040 11894 13184 12710 12324 14222
527152A8169L369J006k78L78J120O59oK44R67J652K827M251L988J234j446j035C8866
$$ 18169 21538 22544 22266 22644 23764 24423 24417 24661 25628 27280 30107 34358 38346 39580 38134 37099 38866
508889D2384K641Q46K29J005K137K450J185r96j885n40M83j756n593o256k754C3944
$$ 42384 45025 45871 46100 47105 49242 51692 52877 51881 49996 49456 49939 48183 42590 36334 33580 33944
491500C3547k779l104j968k162l372l182j953k250l738l121R5J979J2k959k924A971
$$ 33547 30768 27664 25696 23534 20162 16980 15027 12777 9039 5918 6013 7992 8004 5045 2121 1971
473977D122K486J798O87q63j891j334k49o32j943j401J664M095K908o64k822k036C456
$$ 4122 6608 8406 9093 8230 6339 5005 4756 4124 2181 780 2444 6539 9447 8783 5961 3925 3456
455275C010j380j057J592L906K919m89k275m16K389K613Q43M11J995K800J475A8865
$$ 3010 1630 573 2165 6071 8990 8501 6226 5810 8199 10812 11655 12066 14061 16861 18336 18865
437469B1072M658M764K969K303L549M572M352M543O122P308O459M902M859O064I5203
$$ 21072 25730 30494 33463 35766 39315 43887 48239 52782 58904 66212 72671 77573 82432 88496 95203
420583A01943P590Q895Q326N430L147L935O210O710N134L919L860K899n6k803A62085
$$ 101943 109533 118428 126754 132184 135331 139266 145476 152186 157320 161239 165099 167998 167942 165139 162085
403571A60122k141l491l793k877l061n003o273n458m745o086p311n399k050j828I5587
$$ 160122 157981 154490 150697 147820 144759 139756 133483 128025 123280 117194 109883 104484 102434 100606 95587
386433H8825m554k399m684r144r998o457l654n005p766p683m902k815k976l810I314
$$ 88825 84271 81872 77188 68044 58046 51589 47935 42930 35164 27481 22579 19764 16788 12978 9314
369170F588j863j269q01n34n56q63j491k024j122K068N944P266M854J497P48K558B4753
$$ 6588 4725 3456 2655 2121 1565 702 -789 -2813 -3935 -1867 4077 11343 16197 17694 18442 21000 24753
349593B7293N39l33q94k872n326n437k791m33p38k289k423j270j004k005k392c765
$$ 27293 27832 27499 26605 23733 18407 12970 10179 9746 9008 6719 4296 3026 2022 17 -2375 -3765
330956d254n36j38J528K536J209K37K234P324J1048J0993J0079J2151J6344J8050A03188
$$ -4254 -4790 -4928 -3400 -864 345 582 2816 10140 21188 32181 42260 54411 70755 88805 103188
313278A09841k014r339j4027j5331j3631j0699q552q121q865r124p096k632J792E316
$$ 109841 107827 98488 84461 69130 55499 44800 36248 28127 19262 10138 3042 410 2202 5316
296585F453j142j181L68J384J294Q52Q1j418k584j774K86Q28q15j823j98J824C598
$$ 6453 5311 4130 4498 5882 7176 8028 8109 6691 4107 2333 2619 3447 2632 809 611 2435 3598
276399B643o55K253L355J26l897l813j2K074J031j493k158o53J006J499J188Q77D150
$$ 2643 1988 4241 7596 7722 3825 12 0 2074 3105 1612 -546 -1199 -193 1306 2494 3371 4150
256042D794L32Q3K10M73K53l54l19O03Q26q57k572j110L277O218M623Q40m56J855B3473
$$ 4794 5126 5209 5419 5892 6145 5791 5472 6075 6901 6044 3472 2362 5639 11857 16480 17320 16864 18719 23473
233221B9227N756O966R807J2881J5156J7380K1334K7738L5009M0685M4167M6852C62044
$$ 29227 34983 41949 51756 64637 79793 97173 118507 146245 181254 221939 266106 312958 362044
217119D10593M2816L2014J7442m04j9826l5698m3047m2465l8618l3920k7852k2086B18418
$$ 410593 453409 485423 502865 502461 482635 446937 403890 361425 322807 288887 261035 238949 218418
200910A95967k1417j4513p480o089p158m336Q17J445k533l492J819P302P580O224A63687
$$ 195967 174550 160037 152557 146468 139310 134974 135791 137236 134703 131211 133030 140332 147912 154136 163687
182254A81145K5604L3225M3649N8445P4234Q3365P5850M5231k487m8444p5006D15192
$$ 181145 206749 239974 283623 342068 416302 499667 575517 620748 618261 569817 494811 415192
166992C43331o0231m7266l4635k4955j7954j1179n321l076k243L096J2583J7676A82893
$$ 343331 283100 235834 201199 176244 158290 147111 141790 138714 136471 139567 152150 169826 182893
150451A86781k383n250p599q511o025k748j611Q44R586K1733L0430L7477N2870C84396
$$ 186781 184398 179148 171549 163038 157013 154265 152654 153498 163084 184817 215247 252724 305594 384396
132606D86053J05610R0887P3510O7423O9564O3297L5944p907n1837q4709j07287F19368
$$ 486053 591663 682550 756060 823483 893047 956344 992288 984381 932544 847835 740548 619368
117037D99080j01083p4653n6732m8233l7839k3224j5221j7952k0041j2923m409H3043
$$ 499080 397997 323344 266612 218379 180540 157316 142095 124143 104102 91179 86770 83043
101371G8333L767K0127L5816M9304N8963N0931J4631l2922n9591n6034m1944l3105F4014
$$ 78333 82100 102227 138043 187347 246310 297241 311872 278950 219359 163325 121381 88276 64014
84392E3808l06k08M66P891J0325L62q436o373q363k4253l1528%%f615
$$ 53808 53502 53294 53760 61651 71976 72338 63902 57529 49166 24913 -6615 -6615 -6615 -6615
66073f615  $$checkpoint
##END=