##TITLE= Raman spectrum of Graphite � http://rdrs.uaic.ro
##MINERAL= Graphite
##CHEMISTRY= C
##JCAMP-DX= 5.01
##DATA TYPE= RAMAN SPECTRUM
##DATA CLASS= XYDATA
##ORIGIN= Department of Geology, UAIC, Romania
##OWNER= http://rdrs.uaic.ro � stud. Apopei Andrei Ionut
##LONGDATE= 2010/05/11 01:06:09.0287 +0300 $$ export date from JSpecView
##XUNITS= Raman shift (1/cm)
##YUNITS= Intensity (cnt)
##XFACTOR= 3.188909E-3
##YFACTOR= 3.71505481E-4
##FIRSTX= 3399.61
##FIRSTY= -4.73029948
##LASTX= 210.701
##NPOINTS= 1024
##XYDATA= (X++(Y..Y))
$$ plain form
1066073 -12733 20411 23588 18139 27616 19438 5877 -5914 -13321 5148 -2075 8578 321 -16192 -2740
1054452 9790 6949 -9862 -9608 9297 12830 9138 16576 10967 11365 11724 20340 5918 2701 -185 -5431
1041974 -8871 -9732 -5433 7564 803 -18748 -7928 -20956 4607 -3889 -886 -5219 -6603 -7066 1021 -4271
1029405 4036 -6899 744 9894 2970 -8893 -5053 -6080 -5338 12101 12438 17123 5001 40353 32912 44010
1016755 12978 29531 53677 53238 36580 23977 19519 6878 -7384 690 4504 -9796 7124 -9203
1005610 -3932 -982 18222 -10823 8675 -6880 12102 -10384 -7216 10807 30230 14784 10873 5968
994400 -12133 -13279 4778 21508 21245 20503 17881 25911 2500 -1450 -11593 -4818 -9358 -8444 5082 2954
981505 5394 -14986 533 -6213 -2897 4950 -1144 -12626 -11648 -9380 15152 576 -4745 7921 -1785
$$ packed form
1066073a2733L3144L177n449R477q178j3561j1791p407J8469p223J0653q257j6513b740
1054452I790k841j6811K54J8905L533l692P438n609L98L59Q616j4422l217k886e431
1041974h871q61M299J2997o761j9551J0820j3028K5563q496L003m333j384m63Q087d271
1029405D036j0935P643R150o924j1863L840j027P42J7439L37M685j2122L5352p441D4010
1016755A2978J6553K4146m39j6658j2603m458j2641j4262Q074L814j4300J6920i203
1005610c932K950J9204k9045J9498j5555J8982k2486L168J8023J9423j5446l911E968
994400a2133j146J8057J6730k63p42k622Q030k3411l950j0143O775m540R14J3526B954
981505E394k0380J5519o746L316P847o094j1482R78K268K4532j4576n321J2666a785
$$ plain form
969332 10699 4016 6698 -10746 -2084 7794 13506 12325 17962 22824 20756 16882 38402 23652 36953
957083 13392 -1617 -924 3056 -10582 -4171 -5648 -10813 -18 -10270 -6261 -7375 -5578 -18969 -17284
944753 -14937 -3709 1510 -2719 2660 -18059 -6602 -1964 2930 3842 -5164 -17670 -13923 -11579 -25123
932341 -10728 -8055 -6675 -1351 -10220 -7221 6097 12446 -195 -12912 9831 10420 6550 800 16908
919848 6292 15065 10162 -2739 -11290 -1780 -8760 -30810 660 -3808 -12219 1006 1846 -17843 -28797
907273 -11000 -7836 -9684 3580 -6377 15439 -2774 -11735 -8348 -29029 -22766 -25055 6715 29492 18064
894613 21342 6818 -8737 1508 -7302 -17365 -4390 1765 -6785 26758 9988 3723 -26979 -18868
882725 6125 8966 10354 7026 -1388 4315 23988 34077 29312 30703 9720 21910 3028 24359 31131
$$ packed form
969332A0699o683K682j7444Q662R878N712j181N637M862k068l874K1520j4750C6953
957083A3392j5009O93L980j3638O411j477n165J0795j0252M009j114J797j3391a7284
944753a4937J1228N219m229N379k0719J1457M638M894R12r006j2506L747K344b5123
932341a0728K673J380N324q869K999J3318O349j2641j2717K2743N89l870n750A6908
919848F292Q773m903j2901q551R510o980k2050L1470m468q411J3225Q40j9689b8797
907273a1000L164j848J3264r957K1816j8213q961L387k0681O263k289L1770K2777A8064
894613B1342j4524j5555J0245q810j0063J2975O155q550L3543j6770o265l0702a8868
882725F125K841J388l328q414N703J9673J0089m765J391k0983J2190j8882K1331C1131
$$ plain form
869906 42473 42389 46544 53021 58908 78175 66554 88806 88427 118273 122722 124260 145296 157264 183645
857002 199226 221441 243620 268526 291479 288519 315379 318133 327632 349331 373205 406552 384426 393740
844881 394503 379085 350029 315665 311563 305728 278146 287128 276834 256513 251452 217383 186594 151678
832686 147317 154124 121898 88382 79303 84969 73125 100206 95992 79652 88450 43286 40473 47317
820415 31088 21640 17205 11849 20721 -7636 -11370 17332 26618 25085 7961 -15650 11090 5284 -3913
807185 -7912 -3395 -7614 -23885 -23864 -2832 -4284 6208 6822 765 -17676 706 15882 23012 12739 6372
792973 1923 1899 -4613 8559 31904 8181 -9386 4156 855 -713 -2466 -642 8298 -910 -4406 9200
778664 6661 39395 26460 19274 25060 3129 -2511 -8670 -15087 -13654 -9456 21707 14574 21779 12104
$$ packed form
869906D2473q4M155O477N887J9267j1621K2252l79K9846M449J538K1036J1968A83645
857002A99226K2215K2179K4906K2953k960K6860K754R499K1699K3874L3347k2126C93740
844881C94503j5418k9056l4364m102n835k7582Q982j0294k0321n061l4069l0789A51678
832686A47317O807l2226l3516r079N666j1844K7081m214j6340Q798m5164k813D7317
820415C1088r448m435n356Q872k8357l734K8702R286j533j7124k3611K6740n806c913
807185g912M517m219j6271K1K1032j452J0492O14o057j8441J8382J5176P130j0273F372
792973A923k4o512J3172K3345k3723j7567J3542l301j568j753J824Q940r208l496I200
778664F661L2734j2935p186N786k1931n640o159o417J433M198L1163p133P205A2104
$$ plain form
765155 -12535 -11372 6968 13182 15158 11681 8829 156 -4131 6952 -797 3212 11386 20889 5253 8344
750645 -4673 -10083 3064 2053 -2539 7130 2046 -2381 636 7007 -6341 6296 7838 19443 12839
736948 -10905 -12128 -4726 -789 -9127 44 4386 22402 20883 17778 -2097 -8483 -1746 -17273 -13854
723163 -24995 -17265 -12446 -22998 -29901 -23239 -692 -12314 2714 -29203 -25306 -32246 -16037 -2481 -8902
709280 -3233 7265 73 -2365 -10551 -4362 -2890 -1638 6286 -6320 -1121 -8528 -3734 6184 2207 -19276
694372 4378 1592 20627 8589 9488 -12465 -17831 -19254 3761 -12959 6112 -5153 -8861 2137 9228
680298 -9372 -4308 314 -15854 -13886 -9376 -9841 2152 -3806 5901 6947 -20906 -21224 -16419 2908 -17020
665180 11190 1693 8488 -14020 294 -12226 -19217 -3908 4951 6917 -11206 8452 -12248 -7694
$$ packed form
765155a2535J163J8340O214J976l477k852q673m287J1083p749M009Q174R503j5636H344
750645d673n410J3147j011m592R669n084m427L017O371j3348J2637J542J1605A2839
736948a0905j223P402L937q338R171M342J8016j519l105j9875o386O737j5527a3854
723163b4995P730M819j0552o903O662K2547j1622J5028l1917L897o940J6209J3556h902
709280c233J0498p192k438q186O189J472J252P924j2606N199p407M794R918l977a9276
694372D378k786J9035j2038Q99k1953n366j423K3015j6720J9071j1265l708J0998I228
680298i372N064M622j6168J968M510m65J1993n958R707J046k7853l18M805J9327a7020
665180A1190r497O795k2508J4314j2520o991J5309Q859J966j8123J9658k0700g694
$$ plain form
651866 -11616 459 3985 1062 352 2333 225 9801 12782 19045 1866 4702 3611 13791 11620 7236
636544 11035 -3381 -3932 -6397 -9965 -23190 -25464 -20954 -12719 1343 -4158 -5568 3010 -4259 6791 -2873
621112 -592 5890 7176 -3737 4651 -2129 121 969 1557 3140 25657 8955 -2991 8809 -5746 -2830
605568 -7396 -7464 2714 -5906 4862 17768 6680 2446 -7831 15801 1912 7705 -6995 8419 16571
590895 -4026 -1881 -7329 4179 9625 6725 -5759 -17947 2450 3312 1780 12338 4799 17865 15894
576119 66 1598 -8001 684 2845 -21236 -17229 11843 4279 2537 -4916 386 -5812 9112 -1507 -13305
560251 11243 -7631 16402 16699 18028 13129 12100 -242 -9414 3052 4375 -9636 2855 6204 -6186
545268 -12678 7957 9721 6434 12105 9186 11133 -10620 -5504 -351 -21226 -11171 -4987 9859 3550
$$ packed form
651866a1616J2075L526k923p10J981k108R576K981O263j7179K836j091J0180k171G236
636544A1035j4416n51k465l568j3225k274M510Q235J4062n501j410Q578p269J1050b873
621112e92O482J286j0913Q388o780K250Q48N88J583K2517j6702j1946J1800j4555b830
605568g396o8J0178q620J0768J2906j1088m234j0277K3632j3889N793j4700J5414A6571
590895d026K145n448J1508N446k900j2484j2188K0397Q62j532J0558p539J3066A5894
576119F6J532r599Q685K161k4081M007K9072p564j742p453N302o198J4924j0619a3305
560251A1243j8874K4033K97J329m899j029j2342r172J2466J323j4011J2491L349f186
545268a2678K0635J764l287N671k919J947k1753N116N153k0875J0055O184J4846C550
$$ plain form
530181 10030 1842 4047 13810 6470 8898 16192 16484 38670 4499 22484 35089 35493 42680 62141 70361
513975 63248 89161 106117 144343 199560 259755 275939 275648 268428 241857 269691 308768 354552 462410
499701 547820 692463 836926 950127 967754 904325 762026 609031 479481 368693 306671 216967
487389 152844 132033 100015 63427 50541 48639 26612 21542 5082 8600 14662 1705 -1225 -15792
472942 -9279 -7851 286 -9895 -8650 -216 -13492 -780 6034 -9598 7354 -2010 5950 8419 2484
457360 4549 3703 -4109 8058 -2112 -9959 -7925 3912 -725 8092 9722 -1474 -8172 -8285 9220 7193
440621 10106 22199 31381 45061 49748 50493 98126 125782 152332 192486 224864 284410 349484 418947
425873 474405 531413 560224 574697 559946 536605 480314 396381 323910 268657 215542 180858 139946
$$ packed form
530181A0030q188K205R763p340K428P294K92K2186l4171J7985J2605M04P187J9461G0361
513975F3248K5913J6956L8226N5217O0195J6184k91p220k6571K7834L9077M5784D62410
499701E47820J44643J44463J13201J7627o3429j42299j52995j29550j10788o2022B16967
487389A52844k0811l2018l6588j2886j902k2027n070j6460L518O062j2957k930a5792
472942i279J428Q137j0181J245Q434j3276J2712O814j5632J6952r364P960K469B484
457360D549q46p812J2167j0170p847K034J1837m637Q817J630j1196o698j13J7505G193
440621A0106J2093R182J3680M687P45M7633K7656K6550M0154L2378N9546O5074D18947
425873D74405N7008K8811J4473j4751k3341n6291q3933p2471n5253n3115l4684A39946
$$ plain form
412091 130883 92996 81725 65552 42081 43345 40446 29662 6676 10564 15852 1727 623 -3133
397161 -11607 3067 7902 -7426 -7160 -8773 -14698 -17221 -1346 -430 1517 -4198 -2836 -12563 -6475 4997
379973 -20312 -5592 -3914 -7066 4568 4004 6392 -5962 -9763 -6627 3436 -7210 -12582 -517 48
363748 -2922 5389 -7860 -2128 -9477 -8236 -4562 -3356 24243 1076 10935 4061 7508 -4083 4711
347407 9194 -4421 -4509 11256 3282 10828 8717 1153 9586 -11468 -7198 -5250 -904 -281 5518 8832
329853 -3702 3448 2933 543 10097 4280 18665 -11584 -12049 4556 -881 -3661 6607 -5458 1794 11000
312169 3180 3951 -4050 -7221 7820 1090 7797 15021 11852 12258 7579 -3882 -2256 3568 -4465 512
294350 4053 1033 -3277 -3606 5244 4510 1639 2601 5664 -1924 1841 -7406 -8174 -317 4333 10237 6669
$$ packed form
412091A30883l7887j1271j6173k3471J264k899j0784k2986L888N288j4125j104c133
397161a1607J4674M835j5328K66j613n925k523J5875R16J947n715J362r727O088D997
379973b0312J4720J678l152J1634n64K388j2354l801L136J0063j0646n372J2065D8
363748b922Q311j3249N732p349J241L674J206K7599k3167R859o874L447j1591D711
347407I194j3615q8J5765p974P546k111p564Q433k1054M270J948M346O23N799H832
329853c702P150n15k390R554n817J4385l0249m65J6605n437k780J0268j2065P252A1000
312169C180P71q001l171J5041o730O707P224l169M06m679j1461J626N824q033E12
294350D053l020m310l29Q850p34k871R62L063p588L765r247p68P857M650N904F669
$$ plain form
275273 -4751 6167 13298 9743 -4278 -1637 -212 5120 -10813 -465 6309 -7078 -5353 -1082 -8531
258313 -499 9156 -4371 9304 14318 5437 8648 139 2245 -11607 -3215 4242 10446 8467 2581 5909
240091 -14538 4778 -8265 -9808 -9139 5946 -1894 -5533 -14698 981 -5378 4001 12976 12960 8079 7218
221731 -13925 -6491 -1489 -14584 -4494 9135 -5284 -3522 -8284 -6668 -6194 -816 -1446 -6426 -8787 8646
203233 -3629 4591 9420 20700 18343 -6497 -1407 551 -1841 -8322 899 3228 -2403 -16880 -8509 -4319
184594 -7201 -4883 -3520 -4109 -2115 -1556 -9177 5249 -4578 1965 2684 9749 -3494 -1216 -361 -717 13193
164636 2188 9687 -1907 1871 5612 3532 -10638 -3282 -899 -5594 -3210 -5470 196 -1730 8103 650
145705 -9752 -14217 -7795 -6343 9154 -4429 11587 588 -7756 5024 1 4824 6884 -861 317
$$ packed form
275273d751J0918P131l555j4021K641J425N332j5933J0348O774j3387J725M271h531
258313d99R655j3527J3675N014q881L211q509K106j3852Q392P457O204j979n886E909
240091a4538J9316j3043j543O69J5085p840l639r165J5679o359R379Q975j6m881G218
221731a3925P434N002j3095J0090J3629j4419J762m762J616M74N378o30m980k361H646
203233c629Q220M829J1280k357k4840N090J958k392o481R221K329n631j4477Q371d319
184594g201K318J363n89J994N59p621J4426r827O543P19P065j3243K278Q55l56A3193
164636B188P499j1594L778L741k080j4170P356K383m695K384k260N666j926R833F50
145705i752m465O422J452J5497j3583J6016j0999q344J2780n023M823K060p745C17
$$ plain form
127826 7764 7180 11202 18327 430 9035 -1744 2813 -10580 -1007 -1973 527 -4857 -2759 -14184 -2459
108614 382 2490 -5130 -9650 10746 -7263 -5548 -1033 3487 -4965 -294 -855 10013 12552 29579 25600
89255 33195 19453 12752 9113 9162 256 -5552 2022 -2821 -3426 986 -6984 -9608 -9429 -11533 -1914 -660
68523 -3972 -13181
$$ packed form
127826G764n84M022P125j7897Q605j0779M557j3393R573r66K500n384K098j1425b459
108614C82K108p620m520K0396j8009J715M515M520q452M671n61J0868K539J7027B5600
89255C3195j3742o701l639M9q906n808P574m843o05M412p970k624J79k104R619f60
68523c972a3181
66073a4978  $$checkpoint
##END=