##TITLE= Raman spectrum of K2CO3 (Gregoryite) � http://rdrs.uaic.ro
##MINERAL= K2CO3 (Gregoryite)
##CHEMISTRY= K2CO3
##JCAMP-DX= 5.01
##DATA TYPE= RAMAN SPECTRUM
##DATA CLASS= XYDATA
##ORIGIN= Department of Geology, UAIC, Romania
##OWNER= http://rdrs.uaic.ro � stud. Apopei Andrei Ionut
##LONGDATE= 2010/01/06 17:19:46.0113 +0200 $$ export date from JSpecView
##XUNITS= Raman shift (1/cm)
##YUNITS= Intensity (cnt)
##XFACTOR= 3.188736E-3
##YFACTOR= 1.39690739E-3
##FIRSTX= 3399.97
##FIRSTY= 5.36473699
##LASTX= 211.234
##NPOINTS= 1024
##XYDATA= (X++(Y..Y))
1066244C840%%%%%%%%%%%%%%%%%%%%%%%%%%%%%%%%%%%%%%%%%%%%%%%%%%%%%%%%C840
1020884C840%%%%%%%%%%%%%%%K25K06K06K06K06K07K06K06K07K06m4%%%%%%M073G914
992961G914%%k037%%%%%K037%%j18q35j084%%%%K037%%%%%o2j09j10j10j09j10G195
967057G085j10j10j10j10j10j10j10j10j10j10j11j10j11j10j10j11j11j10j11D879
949859D769j11j11j11j11j11j11j11j11k58l41l41l42l41l42j12%%%R42Q57Q57E317
930845F175k98%%%%%%%%%%%%%%J064%%%%%%%%%%%%%%%%%j703j941n75k735J9K697D862
896474G171Q14k552o19O69Q10j046J708j999n69J026m46l88j84j052j381m48J63B206
880336B943j20m91J614j60K12q67j164M00l09on36K90R35o97k66J660J42l93n91B341
$$ y = [3840, 3840, 3840, 3840, 3840, 3840, 3840, 3840, 3840, 3840, 3840, 3840, 3840, 3840, 3840, 3840, 3840, 3840, 3840, 3840, 3840, 3840, 3840, 3840, 3840, 3840, 3840, 3840, 3840, 3840, 3840, 3840, 3840, 3840, 3840, 3840, 3840, 3840, 3840, 3840, 3840, 3840, 3840, 3840, 3840, 3840, 3840, 3840, 3840, 3840, 3840, 3840, 3840, 3840, 3840, 3840, 3840, 3840, 3840, 3840, 3840, 3840, 3840, 3840, 3840, 3840, 3840, 3840, 3840, 3840, 3840, 3840, 3840, 3840, 4065, 4271, 4477, 4683, 4889, 5096, 5302, 5508, 5715, 5921, 5877, 5877, 5877, 5877, 5877, 5877, 5877, 9950, 7914, 7914, 7914, 7914, 5877, 5877, 5877, 5877, 5877, 5877, 7914, 7914, 7914, 7796, 6961, 5877, 5877, 5877, 5877, 5877, 7914, 7914, 7914, 7914, 7914, 7914, 7852, 7743, 7633, 7523, 7414, 7304, 7195, 7085, 6975, 6865, 6755, 6645, 6535, 6425, 6315, 6205, 6095, 5985, 5874, 5764, 5653, 5543, 5433, 5322, 5211, 5101, 4990, 4879, 4769, 4658, 4547, 4436, 4325, 4214, 4103, 3992, 3881, 3623, 3282, 2941, 2599, 2258, 1916, 1804, 1804, 1804, 1804, 2746, 3603, 4460, 5317, 6175, 5877, 5877, 5877, 5877, 5877, 5877, 5877, 5877, 5877, 5877, 5877, 5877, 5877, 5877, 5877, 6941, 6941, 6941, 6941, 6941, 6941, 6941, 6941, 6941, 6941, 6941, 6941, 6941, 6941, 6941, 6941, 6941, 6941, 5238, 3297, 2722, -13, 6, 2703, 4862, 7171, 7985, 5433, 4814, 5483, 6293, 5247, 6955, 4956, 4387, 5413, 4967, 4579, 4395, 3343, 1962, 1514, 1677, 2206, 2943, 2823, 2332, 3946, 3786, 3998, 3131, 1967, 2367, 2058, 2052, 1516, 1806, 2741, 2044, 1778, 3438, 3580, 3187, 2596, 2341]
862342I29r20J246Q98k97K309p30K26r46J588j481m83J0J111N2j994Q43L45n20B945
845050C414J202o86o48m04N04K10k59k103J923q18L56J56j15J169p03j050j332b21
828482A713P35M46K73r90P0J615q11J199o99Q3o48J57n39l36k60O36K12j133j952H59
810007A535J056q00j234J429k174K38J594R74K55L95j043j36J31J672o46k94m16C309
793142B683p30K665J05m23j899M58J60k58k175m75L169R45J530o19o45K64M94D937
776135E017K24j529L7l78N9J105K921J047Q60J495j002K122N06j014j816l42j573F839
758987F372o80m37j945l15M53J418j067N4J761j59j4J39N45j055j831J147R60E493
741692E902q02L49J395j460K02J03p93L51O25L07J781K136k323O16r16n05l44G249
$$ y = [929, 9, 1255, 2153, 1856, 4165, 3435, 3661, 2715, 4303, 2822, 2339, 2349, 3460, 3512, 1518, 2361, 2706, 2186, 2945, 3414, 4616, 3930, 3282, 2878, 3382, 3592, 3333, 1230, 3153, 2335, 2691, 2847, 2732, 3901, 3198, 2148, 816, -221, 1713, 2448, 2894, 3167, 2177, 2247, 3862, 3051, 4250, 3551, 3634, 2986, 3143, 2604, 2268, 2008, 2644, 2856, 1723, -229, 859, 1535, 2591, 1791, 557, 1986, -188, 50, 1644, 2618, 2873, 3268, 2225, 2089, 2220, 3892, 3246, 2952, 2536, 3309, 2683, 1953, 4618, 4723, 4300, 2401, 2859, 3019, 2761, 586, 111, 3280, 4225, 5755, 5136, 4491, 4755, 5249, 4937, 5017, 5241, 3712, 3749, 3371, 3430, 4535, 7456, 8503, 9363, 10858, 9856, 11978, 12484, 11470, 9654, 9312, 7739, 6839, 6372, 5692, 5255, 3310, 2995, 3448, 4866, 3799, 3853, 5614, 5455, 5441, 5580, 6125, 5070, 3239, 4386, 5346, 5493, 5902, 5100, 5449, 6844, 5384, 5586, 5689, 4896, 5247, 5872, 6179, 7960, 10096, 7773, 8389, 7473, 6968, 6624, 7249]
724249D393Q77J786p03K40q61J818K76q82k93k62R66R86j047J13R39ML1j412k07G233
704800F469N86j523Q61J923j992K3o10J43o85K92J035j538J28n56j85o87J161C631
687047C476l4L82J32m53Q90q50K00Q85L35j344O59j000j140J510k52J178j137C876
669140D448J516j543O52j31K66P72q2O48o58m63j42j233J444j489K00J59O42M04E808
650126E439j064j550j316J657K437Q15k323P98j474j176l43M2J176J937L26L77E551
632865C919j513j231j73L256l99k27n49J1j015j770l86P71p18R52J127r32j025A570
614494C621J425P07q12j27J775k261J42J16Q73K52Q48j53j328J52j120J61J037D327
595963D080K180kp57k70P50O71N12o1j06J30J43k90N77j1L39j978m31n4n69k801A225
$$ y = [4393, 5270, 7056, 6353, 6593, 5732, 7550, 7826, 6944, 6651, 6389, 7355, 8341, 7294, 7407, 8346, 8350, 8381, 6969, 6762, 7233, 6469, 7055, 5532, 6393, 8316, 6324, 6347, 5737, 5880, 5195, 5487, 6522, 4984, 5112, 4556, 4371, 3684, 4845, 3631, 3476, 3442, 3824, 3956, 3503, 4393, 3543, 3743, 4628, 4963, 3619, 4278, 3278, 2138, 3648, 3396, 4574, 3437, 3876, 4448, 5964, 4421, 5073, 4942, 5208, 5980, 5898, 6546, 5888, 5425, 5283, 4050, 5494, 4005, 4205, 4364, 5006, 5410, 5808, 5439, 4375, 2825, 1509, 3166, 5603, 6418, 4095, 4893, 3419, 2243, 1900, 1942, 3118, 5055, 5381, 5758, 5551, 3919, 2406, 1175, 1002, 4258, 3859, 3632, 3083, 3094, 2079, 309, -77, 694, -24, 928, 2055, 1123, 98, 1570, 3621, 5046, 5753, 4941, 4814, 6589, 4328, 4470, 4586, 5459, 5711, 6559, 6406, 5078, 5230, 4110, 4271, 5308, 4327, 4080, 6260, 6258, 5501, 5231, 5981, 6652, 7164, 7103, 6997, 7127, 7270, 6980, 7557, 7546, 7885, 5907, 5476, 5422, 4853, 2052, 1225]
574309D082K553p67m979m59L06M484J519M91J52J141p39J264M48J618K334n58A3914
556434A4653P47J177J86P90j942o00k76r15k90N1P9J311j289j034j470N29O89A4157
537401A3912q38P06j61J59J037j278J174r00L19m9p33N83m1L47k95n73N34O97A3518
517192A3687p50L67j105L86R15N42j717R87j328O21l47m32j640r67P99J154R93A1840
497821A1081l33j098o41N89j32p45J251k3m6M02j57j324n37J127j507J066o45I667
478280I443n32j239n51O7n4q07J08L40l68J856M67K32k52m72N46r4L89J647P3I909
456485I608O11N98O44K183K680K136J501N236R33j359p149l611k927J318rK25A1935
437637A2616K367K455K876O455J0773Q009l50o934j0463m541j588k847l277j172A2985
$$ y = [4082, 6635, 5868, 889, 430, 736, 5220, 6739, 7230, 7382, 8523, 7784, 9048, 9496, 11114, 13448, 12890, 13914, 14653, 15400, 16577, 16763, 17553, 15611, 15011, 14735, 13820, 13530, 13581, 13660, 14971, 13682, 12648, 11178, 11707, 12396, 14157, 13912, 13074, 13780, 13619, 13778, 14815, 13537, 14711, 13811, 14130, 14081, 13348, 13931, 13890, 14237, 13942, 13369, 13903, 14600, 13518, 13687, 12937, 13304, 12199, 12585, 13500, 14042, 12325, 13312, 11984, 12605, 12258, 11826, 10186, 9219, 10018, 11172, 12165, 11840, 11081, 10748, 9650, 9009, 9598, 9466, 8721, 9972, 9949, 9903, 10305, 10148, 8824, 8287, 9414, 7907, 8973, 8328, 9667, 9443, 8911, 7672, 7121, 7188, 7134, 6327, 6435, 6775, 6407, 8263, 8730, 8962, 8710, 8238, 8784, 8690, 9079, 10726, 10799, 9909, 9608, 10219, 10817, 11461, 13644, 16324, 18460, 19961, 25197, 26130, 24771, 17622, 14011, 11084, 12402, 12393, 12618, 11935, 12616, 14983, 17438, 20314, 26769, 37542, 45551, 45201, 38267, 27804, 23263, 21675, 18828, 15551, 14379, 12985]
420750A1618n62p08j61j465J76j056Q17N42j370q6j70j29J459k591p4j516r23D724
400535C973R56k65K030m26j130n76j89M26J78n86O90j280L05p6j043L52n84j341A973
379066A463K08n84N75lL23P06k61j013L24N09l76J089o36m89r58j67j30o09P01E8
356307A058m9p00N00m39P92L40q29J030O84K91J819J274J849J391N926J0076J9266I2060
335522C02468M12266K85033j74688m54484k70520o2031j0568n404J61M669J5539E8420
321196E7363j7691j7748r995l331k861j641p10r84j296j149M45J910PP66l36L5C173
301217C121r11K96j976j56M5J261K003N2o03P40P58q04M31K44m14j086o76P94E620
278819F498O49j483J967p08o78M08m92o0o72Q26M19P87O84L8L49J124l70J123A1160
$$ y = [11618, 11056, 10348, 10187, 8722, 8898, 7842, 8659, 9201, 7831, 7745, 7575, 7446, 8905, 6314, 6240, 4724, 3801, 4724, 3973, 4929, 4664, 6694, 6268, 5138, 4562, 4373, 4799, 4977, 4391, 5081, 3801, 4106, 4030, 2987, 3339, 2755, 1414, 1973, 1463, 1671, 1087, 1662, 1659, 1982, 2688, 2427, 1414, 1738, 2247, 1871, 2960, 2324, 1835, 877, 710, 580, -29, 672, 58, 1058, 1009, 309, 809, 370, 1162, 1502, 673, 1703, 2387, 2678, 4497, 5771, 7620, 9011, 14937, 25013, 44279, 92060, 302468, 714734, 999767, 825079, 370595, 100075, 38044, 27476, 22072, 22233, 26902, 42441, 58420, 57363, 39672, 21924, 11929, 8598, 5737, 4096, 3386, 2402, 1106, -43, 402, 2312, 2319, 3085, 2749, 2784, 3173, 3121, 2210, 2506, 530, 374, 419, 1680, 3683, 3735, 3132, 3872, 4630, 3826, 4257, 4501, 4087, 3001, 2325, 3119, 5620, 6498, 7147, 5664, 7631, 6923, 6245, 6653, 6161, 6101, 5429, 6255, 6674, 7461, 8145, 8183, 8532, 9656, 9286, 10409, 11160]
256211A3111N18n27P68N43k28j943n26r3K75r4p98J087k718J139o3j89q31J486A0289
233391I185q76J30K51J51R26n24J152K075L286L509N914J550m146l968m243J396A8968
212668B1832k16l094m177l459j849J098p46N74O71o50j340q37m74O22j02K86P48I568
190603I896J20K43l95P00j826m96q00m56p57j434J60N58r54j153q68J4p67Jj297A309
165984A386M72M85p14j548O58L41o27M77J296L577K350M17n8k532l638n71l50I49
143498B704L97O97j426j172J5o01R62J66k59l07Q00P51l35j301q75j81k68O17h
119608G84o84j66J862j341N94l33o36Q34j09p79P14OK6K30O60M71K296M212L954A9516
94278B5679Q219M207J232J23l191l609J219J84J37r25j645J259M861Q388Q467E8134
$$ y = [13111, 13629, 13102, 13870, 14413, 14185, 12242, 11716, 11623, 11898, 11804, 11006, 12093, 9375, 10514, 10451, 10262, 9431, 10917, 10289, 9185, 8309, 8439, 8690, 8841, 9767, 9243, 10395, 12470, 15756, 19265, 25179, 26729, 22583, 18615, 14372, 15768, 18968, 21832, 21616, 18522, 14345, 10886, 9037, 10135, 9389, 9963, 10634, 9984, 8644, 7807, 7333, 7955, 7853, 8139, 8887, 9568, 9896, 10016, 10259, 9864, 10564, 8738, 8242, 7442, 6986, 6229, 4795, 4955, 5513, 4559, 3406, 2538, 2552, 1785, 1786, 489, 1309, 1386, 1858, 2343, 1629, 81, 739, 1080, 453, 930, 2226, 5803, 8153, 8570, 8512, 5980, 2342, 1771, 1421, 949, 2704, 3101, 3798, 2372, 1200, 1215, 614, 1576, 1742, 1483, 1176, 1976, 2727, 2392, 1091, 216, 35, -233, 384, -8, 784, 100, -66, 1796, 455, 1049, 716, 80, 914, 805, 26, 740, 746, 772, 1002, 1662, 2133, 4429, 8641, 12595, 19516, 25679, 33898, 38105, 39337, 39460, 36269, 32660, 33879, 34063, 34200, 33275, 31630, 32889, 37750, 46138, 54605, 58134]
73587E9237o209p864q046n008B8933
$$ y = [59237, 53028, 45164, 37118, 32110, 28933]
66244B9371  $$checkpoint
##END=