##TITLE= Raman spectrum of Grunerite � http://rdrs.uaic.ro
##MINERAL= Grunerite
##CHEMISTRY= []Fe++7Si8O22(OH)2
##JCAMP-DX= 5.01
##DATA TYPE= RAMAN SPECTRUM
##DATA CLASS= XYDATA
##ORIGIN= Department of Geology, UAIC, Romania
##OWNER= http://rdrs.uaic.ro � stud. Apopei Andrei Ionut
##LONGDATE= 2010/10/09 12:13:08.0150 +0200 $$ export date from JSpecView
##SPECTROGRAPHDATASYSTEM= HE 532 (Horiba Jobin-Yvon)
##XUNITS= Raman shift (1/cm)
##YUNITS= Intensity (cnt)
##XFACTOR= 3.188909E-3
##YFACTOR= 5.67514592E-4
##FIRSTX= 3399.61
##FIRSTY= -1.18740633
##LASTX= 210.701
##NPOINTS= 1024
##XYDATA= (X++(Y..Y))
$$ plain form
1066073 -2092 -180 226 -2708 5065 3669 4500 747 3346 3194 6251 7180 3458 -165 6035 -1453 2979
1052896 4725 1363 4354 10782 1231 5465 1546 1720 2941 2230 -7945 841 -1814 1164 2407 3224 636
1039622 634 8131 -3824 -3433 -422 3930 1865 6283 91 1103 -144 508 3550 4103 2692 2525 818
1026251 2255 -1678 4900 115 9083 2955 -2060 -165 4546 4574 5879 9050 9536 7239 6808 2643 7484
1012782 2697 1611 5862 3924 -2730 5418 6001 2752 -2166 1429 -1198 2692 2718 4839 2376 -382 4391
999213 7461 675 405 2395 -1347 1101 -4965 2820 -1184 707 698 329 -5018 1817 -3160 -1600 3856 2337
984735 6647 8305 1284 5332 3715 6944 3492 1416 -169 -2868 786 -1028 2429 6508 1321 -298
971774 -345 -5173 -1815 692 -566 -3266 -727 1321 3206 6367 5369 10004 3898 1721 886 8271 5177
$$ packed form
1066073b092J912M06k934P773j396Q31l753K599j52L057R29l722l623O200p488B979
1052896D725l362K991O428r551M234l919J74J221p11j0175Q786k655K978J243Q17F36
1039622F34P497j1955L91L011M352k065M418o192J012j247O52L042N53j411j67H18
1026251B255l933O578m785Q968o128n015J895M711K8J305L171M86k297m31m165G484
1012782B697j086M251j938o654Q148N83l249m918L595k627L890K6K121k463k758D391
999213G461o786k70J990l742K448o066P785m004J891rl69n347O835m977J560N456B337
984735F647J658p021M048j617L229l452k076j585k699L654j814L457M079n187b98
971774c45m828L358K507j258k700K539K048J885L161r98M635o106k177q35P385E177
$$ plain form
957901 1690 6946 -3123 201 -10360 234 6537 -520 -3255 -881 -5024 1639 11249 -5993 4992
945574 3174 3647 4382 4135 -664 -1206 6439 2165 5542 3352 -377 -242 -4627 4906 3894 5273 2329 3773
930679 -1332 -2344 2014 7682 743 3037 4874 2322 2652 6452 4195 2560 2758 304 5676 3091 -1132
916502 -1524 -1719 -4272 -767 -700 87 1135 154 1071 -1941 -303 -270 -106 2875 8120 5310 141 1260 1069
900531 -2495 3699 4719 991 -1493 -1520 4248 2190 1277 5474 -1628 -1918 -2568 -698 4088 -558 2852 269
885278 8361 1718 2475 2118 387 4745 -261 8027 3119 -4082 571 1426 -4334 2022 3760 98 2827
870765 -534 -2913 1093 -369 6748 1552 3266 4587 -7387 4937 -3468 4435 -4068 2099 4533 8146
857002 887 2011 3724 -5107 3189 5328 4422 437 -3220 2423 4267 5358 1733 6033 4734 -8093 -879
$$ packed form
957901A690N256j0069L324j0561J0594O303p057k735K374m143O663R610j7242D992
945574C174M73P35k47m799n42P645m274L377k190l729J35m385R533j012J379k944C773
930679a332j012M358N668o939K294J837k552L30L800k257j635J98k454N372k585a132
916502a524j95k553L505O7P87J048r81R17l012J638L3J64K981N245k810n169J119A069
900531b495O194J020l728k484k7N768k058r13M197p102k90o50J870M786m646L410B69
885278H361o643P57l57j731M358n006Q288m908p201M653Q55n760O356J738l662B827
870765e34k379M006j462P117n196J714J321j1974J2324q405P903q503O167K434H146
857002H87J124J713q831Q296K139r06l985l657N643J844J091l625M300j299j2827h79
$$ plain form
842276 -1884 -4068 -4614 -1068 -4627 -1408 -2479 -864 -1018 -2482 -2996 2482 3539 -1723 6440 3765 -2644
827437 -179 -1479 -2059 -4486 856 -2873 1060 1260 5259 -3644 -2788 2586 -2780 -2645 731 1783 5979 -3907
811607 -4197 719 4685 563 993 -5945 870 -1745 4710 -3079 -2224 4297 -2477 311 3524 -303 -233
796536 3275 -4776 -384 -2992 -345 237 -6909 -3314 -277 -2380 722 -390 -6286 -5599 -9955 -6583 -2587
781355 852 912 -1156 1458 -3427 497 1146 7133 447 -149 4463 -4581 259 -1351 -866 -174 3956 -1050
765155 1344 5964 4298 1616 3747 2309 -1978 1791 -3676 -1545 2747 981 3766 2294 6488 -2451
750645 2790 4134 3611 1713 3809 568 -3067 3123 -250 798 634 3483 600 2434 632 3775 -1466
735117 -7590 202 -3991 -8021 -5337 -2556 7790 138 345 -3739 4556 -542 582 -947 -2771 -468
$$ packed form
842276a884k184n46L546l559L219j071J615j54j464n14N478J057n262Q163k675b644
827437a79j300n80k427N342l729L933K00L999q903Q56N374n366J35L376J052M196c907
811607d197M916L966m122M30o938O815k615O455p789Q55O521o774K788L213l827b33
796536C275q051M392k608K647N82p146L595L037k103L102j112n896O87m356L372b587
781355H52O0k068K614m885L924O49N987o686n96M612r044M840j610M85O92M130a050
765155A344M620j666k682K131j438m287L769n467K131M292j766K785j472M194b451
750645B790J344n23j898K096l241l635O190l373J048j64K849k883J834j802L143a466
735117g590P792m193m030K684K781J0346p652K07m084Q295n098J124j529j824d68
$$ plain form
720394 3701 2893 4803 295 -1463 -2598 -1408 -415 -2827 1474 4006 2773 427 7085 4477 395 -1951
704633 4282 -4613 -3946 2124 -190 4161 -1832 -4517 657 2720 3964 2720 -718 -2749 -6089 3932 68
688753 -3305 -3207 -2028 3211 133 4488 -291 2866 -1673 -3657 3069 -1176 -2571 -1412 -1924 -5153 -3765
672754 1454 91 -7822 2276 29 3414 1887 -590 -1659 940 2130 8265 -834 4492 -7962 -343
657582 3019 -1642 -1456 -4446 914 1887 -2609 361 3495 1095 -781 -3737 -308 -6571 952 5105 2788
641345 -1069 1493 4022 199 6166 771 -2109 4696 -6051 2163 -692 -795 -3059 2668 -1724 2235
625948 4983 4718 0 11690 4093 7630 1342 0 1836 2656 7766 4722 5247 5117 2531 -2380 2762
609465 3647 3483 4793 -4081 -1559 6529 -4016 -2445 -317 -4771 1226 5010 3226 68 -4696 1838
$$ packed form
720394C701q08J910m508j758j135J190R93k412M301K532j233k346O658k608m082a951
704633D282q895O67O070k314M351n993k685N174K063J244j244l438k031l340J0021F8
688753c305R8J179N239l078M355m779L157m539j984O726m245j395J159n12l229c765
672754A454j363p913J0098k247L385j527k477j069K599J190O135r099N326j2454c43
657582C019m661J86k990N360R73m496K970L134k400j876k956L429o263P523M153B788
641345a069K562K529l823N967n395k880O805j0747Q214k855j03k264N727m392B235
625948D983k65m718J1690p597L537o288j342J836Q20N110l044N25j30k586m911B762
609465C647j64J310q874K522Q088j0545J571K128m454N997L784j784l158m764A838
$$ plain form
593836 2412 -4185 -2923 -4052 -1153 -318 2516 -677 748 -1887 258 4204 -6414 -3238 1740 4393
578097 791 2298 -1629 828 -1037 -6307 16 -2208 513 -2497 -2165 -1539 659 2857 -2967 4270 1334
561245 558 13 4315 5833 1229 -2819 1648 -2824 317 -213 -4803 -4580 2683 1498 -3585 -2675 2766 -5212
543261 -1729 -3485 -2982 -6048 -1844 2098 -2736 158 -2776 3950 2587 701 -39 -2874 1429 3603 -935
526142 -2820 -3461 3702 -121 -4534 222 1737 3711 1395 2419 2625 6368 2022 2130 7347 2315 328
508889 -2244 -2546 -6680 1008 -1815 -937 858 -4847 6674 -2009 1685 -4008 126 1640 1844 -2044 453
491500 560 -5423 -665 -2489 4268 -76 2796 1321 -1005 2366 3871 4525 2494 -1142 4030 1606 623
473977 -1572 -3276 -3768 -5898 1142 -988 -1447 2481 1335 581 2618 -1603 5114 -842 865 509 -3449
$$ packed form
593836B412o597J262j129K899Q35K834l193J425k635K145L946j0618L176M978D393
578097G91J507l927K457j865n270O323k224K721l010L32O26K198K198n824P237A334
561245E58n45M302J518m604m048M467m472L141n30m590K23P263j185n083R10N441e212
543261a729j756N03l066M204L942m834K894k934O726j363j886p40k835M303K174i35
526142b820o41P163l823m413M756J515J974k316J024K06L743m346J08N217n032C28
508889b244l02m134P688k823Q78J795n705J1521q683L694n693M134J514K04l888D53
491500E60n983M758j824O757m344K872j475k326L371J505O54k031l636N172k424F23
473977a572j704m92k130P040k130m59L928j146p54K037m221O717n956J707l56c449
$$ plain form
456319 1173 1014 -4907 -186 -1261 1561 4645 -5106 402 638 4509 3633 1021 2452 -4238 4430 -982
438520 -1809 868 1155 -1309 2025 4900 3846 598 1870 70 1900 1111 2057 2741 314 343 -151 -2316
419523 3051 1902 -656 3532 4053 2609 -3977 4567 2501 860 -1435 -2912 1637 -2252 5005 -4571 -818
401435 773 -156 -1250 3748 1541 -3056 -3526 2683 -308 368 -233 279 -2876 3630 403 5070 -1560 3796
382131 507 -4058 -4006 -1039 -461 -2667 5345 357 1427 3939 0 8318 0 4147 3611 4058 8499 10551
362663 3498 1031 3279 1532 5876 6552 6672 9182 10448 10077 10885 14181 18558 21036 34845 39910 45564
344127 44735 40009 31321 30165 23540 28049 23356 13588 19538 20281 21352 25141 34530 42085 45743 60305
326547 77193 101612 137330 172686 192947 172145 120396 83090 59471 59266 57391 64357 76072 64537
$$ packed form
456319A173j59n921M721j075K822L084r751N508K36L871q76k612J431o690Q668i82
438520a809K677K87k464L334K875j054l248J272j800J830p89R46O84k427K9m94b316
419523C051j149k558M188N21j444o586Q544k066j641k295j477M549l889P257r576h18
401435G73r29j094M998k207m597m70O209k991O76o01N12l155O506l227M667o630C796
382131E07m565N2K967N78k206Q012m988J070K512l939Q318q318M147n36M47M441A0551
362663C498k467K248j747M344O76J20K510J266l71Q08L296M377K478J3809N065D5564
344127D4735m726q688j156o625M509m693r768N950P43J071L789R389P555L658F0305
326547G7193K4419L5718L5356K0261k0802n1749l7306k3619k05j875O966J1715F4537
$$ plain form
311058 58667 62589 71618 98233 132641 158470 160656 137759 98423 67044 38941 30419 19147 16913
295468 8981 9039 15483 12398 13766 20276 24068 27597 25953 33478 26432 23904 14499 11906 15993 15397 13394
276399 12733 6112 2733 1254 4263 -3724 2829 2436 2436 1257 -118 1355 2076 3611 -4090 948 1828
257178 -698 1852 -1164 -1058 2674 6176 3883 10300 10496 18190 16651 11084 24281 28964 33451 39511 40822
237803 41249 34702 35883 37130 30059 21679 19357 21816 18153 21366 16785 16692 17319 23480 30067 40191 47532
218273 56871 73512 88320 106829 170265 288814 512640 776779 989640 970197 760628 506006
204393 301284 171979 120315 83355 59788 41100 30534 23898 21584 12230 10605 9635 7683 0
188099 2809 5454 6167 6913 10475 7783 7940 12584 20207 29533 23207 21793 23523 27119 32714 49507 67578
$$ packed form
311058E8667L922R029K6615L4408K5829K186k2897l9336l1379k8103q522j1272A6913
295468H981N8O444l085J368O510L792L529j644P525p046k528r405k593M087n96A3394
276399A2733o621l379j479L009p987O553l93%j179j375J473P21J535p701N038A828
257178f98K550l016J06L732L502k293O417J96P694j539n567J3197M683M487O060D0822
237803D1249o547J181J247p071q380k322K459l663L213m581r3O27O161O587J0124D7532
218273E6871J6641J4808J8509O3436J18549K23826K64139K12861j9443k09569E06006
204393C01284j29305n1664l6960k3567j8688j0566o636k314r354j625r70j952@
188099B809K645P13P46L562k692J57M644P623R326o326j414J730L596N595J6793F7578
$$ plain form
168169 85289 99856 93400 82818 67751 60968 54087 47567 40064 33380 22800 19293 10972 9528 3696
150451 -498 4706 2273 -174 0 3186 2050 3435 6457 10266 21409 19193 45596 71378 87991 119208
131411 141027 146736 138593 119578 102266 77521 61879 54948 45725 53235 78789 110924 131500 156202
114633 163517 162120 162918 150715 138480 112099 91546 70634 62362 57953 54625 57225 53341 51848 50485
96531 53805 50609 57368 60361 60079 58259 51036 40767 33183 20295 5966 9615 3833 375 449 7173
77080 4661 6962 7658 658 4450 10843 10785 27690 34607
$$ packed form
168169H5289J4567o456j0582j5067o783o881o520p503o684j0580l507q321j444C696
150451d98N204k433k447J74L186j136J385L022L809J1143k216K6403K5782J6613A19208
131411A41027N709q143j9015j7312k4745j5642o931r223P510K5554L2135K0576A56202
114633A63517j397P98j2203j2235k6381k0553k0912q272m409l328K600l884j493E0485
96531E3805l196O759K993k82j820p223j0269p584j2888j4329L649n782l458P4G173
77080D661K301O96p000L792O393n8J6905C4607
66073E1413  $$checkpoint
##END=