##TITLE= Raman spectrum of Gypsum � http://rdrs.uaic.ro
##MINERAL= Gypsum
##CHEMISTRY= CaSO4*2(H2O)
##JCAMP-DX= 5.01
##DATA TYPE= RAMAN SPECTRUM
##DATA CLASS= XYDATA
##ORIGIN= Department of Geology, UAIC, Romania
##OWNER= http://rdrs.uaic.ro � stud. Apopei Andrei Ionut
##LONGDATE= 2009/11/08 22:08:32.0481 +0200 $$ export date from JSpecView
##XUNITS= Raman shift (1/cm)
##YUNITS= Intensity (cnt)
##XFACTOR= 3.188736E-3
##YFACTOR= 2.94081216E-3
##FIRSTX= 3399.97
##FIRSTY= 517.49130826
##LASTX= 211.234
##NPOINTS= 1024
##XYDATA= (X++(Y..Y))
$$ plain form
1066244 175969 172736 155352 137236 124567 108520 94485 84196 73276 68775 62717 54293 50966 48929
1055399 46592 44044 41437 37693 37239 37669 34850 32180 30113 28531 27835 27638 23937 23367 22271 22961 19659 20007
1041359 19958 21281 19412 16216 18237 18716 16148 18032 12717 14011 16120 17210 15277 13944 14377 11641 12436
1027997 12195 10462 11368 9224 10775 10345 12166 9824 8751 7318 7513 8417 11376 8298 9630 11634 11924
1014540 10576 8715 7486 4569 4167 4647 4511 2915 4395 721 848 3308 5812 2676 3282 2991 1860 5402
1000183 19 55 3330 5089 4768 5453 331 1663 914 -131 1013 1772 786 1509 243 2769 1910 1786 3241
984904 2830 1019 1721 58 762 2405 934 2068 1883 2079 3916 5869 4528 5536 6663 5937 5831 3271
970316 6613 5636 4501 3268 2267 4684 4355 5313 3990 4072 7273 5778 6380 6113 8504 7622 6286 5323
$$ packed form
1066244A75969l233j7384j8116j2669j6047j4035j0289j0920m501o058q424l327D8929
1055399D6592k548k607l744m54M30k819k670k067j582o96j97l701n70j096O90l302B0007
1041359A9958J323j869l196K021M79k568J884n315J294K109J090j933j333M33k736A2436
1027997A2195j733R06k144J551m30J821k342j073j433J95R04K959l078J332K004A1924
1014540A0576j861j229k917m02M80j36j596J480l674J27K460K504l136O06k91j131E402
1000183A9L6L275J759l21O85n122J332p49j045J144P59r86P23j266K526q59j24C241
984904B830j811P02j663P04J643j471J134j85J96J837J953j341J008J127p26j06C271
970316F613r77j135j233j001K417l29R58j323Q2L201j495O02k67K391q82j336E323
$$ plain form
955611 5546 5601 2370 1857 1708 5257 3360 4951 9030 10874 10536 9958 8488 7094 7746 7985 8614 11048 7629
939965 9933 11028 8336 9179 7375 6307 9997 11445 14621 14283 10981 12168 11242 9902 9998 13047 13845 15207
925022 12675 12214 13186 14521 11868 13724 13420 12171 11864 10001 11406 13223 12834 11637 15161 13537 13306
910800 12262 13658 11229 12755 14309 14284 16716 13271 16316 13676 14897 14816 15866 14433 13485 13871 16308 17421
895628 19262 21551 17694 20711 19247 18645 20441 20282 18278 17729 17194 18670 18795 16633 18293 19579 20038
881189 19762 18773 18369 19972 19684 18247 19231 19790 18541 16318 19375 19711 18745 19432 19904 17522 17048 19065 20118
864923 20754 20599 19087 17396 17028 17510 19609 20103 19900 17815 15553 18571 20446 15961 19467 18858 16780 18156
849387 16847 18128 17186 17020 18848 15606 15666 15729 15540 19258 18603 15249 14600 15218 14305 13871 15972 16536 16453
$$ packed form
955611E546N5l231n13j49L549j897J591M079J844l38n78j470j394O52K39O29K434G629
939965I933J095k692Q43j804j068L690J448L176l38l302J187r26j340R6L049P98A5207
925022A2675m61R72J335k653J856l04j249l07j863J405J817l89j197L524j624A3306
910800A2262J396k429J526J554k5K432l445L045k640J221q1J050j433r48L86K437A7421
895628A9262K289l857L017j464o02J796j59k004n49n35J476J25k162J660J286B0038
881189A9762r89m04J603k88j437R84N59j249k223L057L36r66O87M72k382m74K017B0118
864923B0754j55j512j691l68M82K099M94k03k085k262L018J875m485L506o09k078A8156
849387A6847J281r42j66J828l242O0O3j89L718o55l354o49O18r13m34K101N64A6453
$$ plain form
832854 18287 15759 13271 12301 10928 13710 12200 12971 12710 11677 12417 14355 14512 11811 13029 10276 14862
817945 11691 11219 8428 10192 10290 9850 9752 10631 7930 9487 9573 11900 8642 10058 8473 8607 11232 10174 8859
801148 7710 7154 6476 8766 7632 4662 4044 3046 5035 3957 3123 6093 6619 6449 5657 3870 4272 3319 2041
784210 2243 1416 4048 3860 6758 2510 547 2279 4557 3720 2708 1409 3159 509 -3 950 890 2814
768032 5675 5924 3700 2354 4479 3651 1683 2170 4170 2499 3749 2704 7156 1480 1304 6103 5205
752634 6209 5575 6015 8834 10305 9872 9753 7524 5993 9138 7507 7776 10170 7667 9084 9190 8185 9655
736201 8613 8048 9958 12895 10618 10930 14769 11601 9921 12781 13225 11433 11815 13588 11463 14328 13443
720561 10403 12563 9649 13439 11797 13929 13895 14041 11908 10196 9616 7592 9685 10202 9494 11805 10206 14088
$$ packed form
832854A8287k528k488r70j373K782j510P71k61j033P40J938J57k701J218k753A4862
817945A1691m72k791J764R8m40r8Q79k701J557Q6K327l258J416j585J34K625j058H859
801148G710n56o78K290j134k970o18r98J989j078q34K970N26j70p92j787M02r53B041
784210B243q27K632j88K898m248j963J732K278q37j012j299J750k650n12R53o0B814
768032E675K49k224j346K125q28j968M87K000j671J250j045M452n676j76M799E205
752634F209o34M40K819J471m33j19k229j531L145j631K69K394k503J417J06j005I655
736201H613n65J910K937k277L12L839l168j680K860M44j792L82J773k125K865A3443
720561A0403K160k914L790j642K132l4J46k133j712n80k024K093N17p08K311j599A4088
$$ plain form
703871 11315 9757 10059 13634 12320 12044 11759 10453 8057 7471 7297 8257 8515 10026 10305 6937 8984 5865
687047 8138 5769 8486 6547 6870 7255 7248 7746 7108 9053 8132 10459 9744 8751 11869 8976 12556 11159 13208
669140 11828 10603 11356 8156 7080 10445 14067 15569 13989 13097 11955 8673 9093 9876 10847 11663 10115 11652
652033 9919 8429 9836 7954 8309 5379 6338 5504 10532 9657 9154 8127 6558 6342 8178 9910 8472 7093
634791 6774 7941 6575 7170 3639 60 5899 4626 1982 2283 3749 2711 1997 715 2090 656 589
618374 1292 -62 2944 5798 5099 4067 6224 7499 6013 9023 6917 6848 5102 6654 10632 9795 7947
601834 7732 11737 10010 10958 9042 11474 13007 13397 12204 13654 14451 12306 13865 12091 12314 11744 11469 11366
584181 13444 12220 11724 14409 16540 15607 13413 13614 12672 11710 13391 15141 15036 10887 11400 10710 8946 9435
$$ packed form
703871A1315j558L02L575j314k76k85j306k396n86j74R60K58J511K79l368K047E865
687047H138k369K717j939L23L85pM98o38J945r21K327p15r93L118k893L580j397A3208
669140A1828j225P53l200j076L365L622J502j580q92j142l282M20P83R71Q16j548A1652
652033I919j490J407j882L55k930R59q34N028q75n03j027j569k16J836J732j438G093
634791F774J167j366N95l531l579N839j273k644L01J466j038p14j282J375j434E89
618374A292j354L006K854o99j032K157J275j486L010k106o9j746J552L978q37G947
601834G732M005j727R48j916K432J533L90j193J450P97k145J559j774K23n70k75A1366
584181A3444j224m96K685K131r33k194K01r42r62J681J750j05m149N13o90j764I435
$$ plain form
566384 9280 9627 10178 8739 9565 10077 9626 11297 9901 11275 7583 7112 6368 6621 6958 9476 12166 10096 9174
547439 9568 10208 9865 9912 9837 8949 8435 8834 11555 13046 10338 12818 9628 11054 12867 13756 16251 13112 14111
528332 13217 14312 14458 17345 16334 16391 15612 13767 13998 16856 18102 18505 16856 18306 17952 20596 18700 17359
510074 14412 16503 15646 13585 12174 11160 9690 10189 8999 8388 7506 9162 6553 7666 5098 6792 7841
492697 5067 4866 4887 7586 5103 4524 5375 5302 4505 8142 4619 6220 5131 3596 4658 6594 5324 7800
474147 7029 6576 6548 4728 7613 7247 8938 10236 11088 12040 11677 8914 10177 10460 11300 9744 9593 8889 10305
454399 11430 11339 10064 10386 9510 9559 8669 11029 9563 8887 10056 7702 6461 7494 7086 5328 3415 1749
435533 4724 5298 4092 2031 2516 1876 3301 1329 2447 3645 3206 13 2570 876 3630 1438 2702
$$ packed form
566384I280L47N51j439Q26N12m51J671j396J374l692m71p44K53L37K518K690k070I174
547439I568O40l43M7p5q88n14L99K721J491k708K480l190J426J813Q89K495l139A4111
528332A3217J095J46K887j011N7p79j845K31K858J246M03j649J450l54K644j896A7359
510074A4412K091q57k061j411j014j470M99j190o11q82J656k609J113k568J694G841
492697E067k01K1K699k483n79Q51p3p97L637l523J601j089j535J062J936j270G800
474147G029m53k8j820K885l66J691J298Q52R52l63k763J263K83Q40j556j51p04A0305
454399A1430r1j275L22q76M9q90K360j466o76J169k354j241J033m08j758j913A749
435533D724N74j206k061M85o40J425j972J118J198m39l193K557j694K754k192B702
$$ plain form
417570 1374 2747 4201 3612 4582 3980 4638 6298 4319 7699 5914 7611 6311 5938 7367 5470 5065 5223
398399 7895 8758 9157 8658 9246 10471 9751 11457 9519 9802 8120 9758 10451 9610 8549 6699 7623 6920 5962
377987 5209 6043 7857 6824 5472 1877 3468 4999 3955 6578 6288 8602 8017 9894 12304 21355 41308
359572 62230 78978 76379 60596 40119 24732 19588 16642 16409 14161 10390 9788 9018 7746 6749 7520
342104 5865 5841 6324 8185 7670 8157 7570 7122 5718 7158 8085 7316 8377 8740 10587 12810 17184 21631 29568
321196 48161 110214 343468 743620 999850 831962 412889 148631 66571 42844 29206 21355
307895 14698 11125 9225 7926 5063 2815 1569 3253 1678 1681 2472 1452 2025 2325 796 2847 2217 1507
287804 107 1283 2088 3320 940 -150 899 3175 2927 2801 2782 3294 1669 2740 4512 4876 4670 4777 2973
$$ packed form
417570A374J373J454n89R70o02O58J660j979L380j785J697j300l73J429j897m05E223
398399G895Q63L99m99N88J225p20J706j938K83j682J638O93q41j061j850R24p03E962
377987E209Q34J814j033j352l595J591J531j044K623k90K314n85J877K410R051D1308
359572F2230J6748k599j5783k0477j5387n144k946k33k248l771o02p70j272r97G520
342104E865k4M83J861n15M87n87m48j404J440R27p69J061L63J847K223M374M447B9568
321196D8161O2053K33254M00152K56230j67888m19073k64258q2060k3727j3638B1355
307895A4698l573j900j299k863k248j246J684j575LP91j020N73L00j529K051o30A507
287804A07J176Q05J232k380j090J049K276k48j26j9N12j625J071J772L64k06J07B973
$$ plain form
266412 2095 3847 3056 1924 3413 1985 3540 6638 1623 1466 1063 348 2920 3223 2780 2756 3172 4044 3348
244828 915 2543 3852 3856 1235 3467 6152 4045 3522 2943 2025 4409 5139 4253 4072 3976 2336 3412 2160
223052 2633 48 4692 5422 5670 4445 4342 6433 6481 9987 13289 10507 9566 7665 4333 6849 6702 7148
202241 8854 16014 18850 30956 46376 59813 65423 63561 53567 46619 37083 31529 27766 27809 26379 25093
183594 21771 17203 14894 14134 12322 10394 8413 7842 4907 4533 5574 5696 2279 3643 3111 5835 7007
163627 8286 15360 24787 43394 76046 116934 151144 156419 134181 95334 59516 34678 21771 14178
147062 10570 9276 8924 7464 6673 8453 7519 7655 8602 13989 22358 39856 62303 78566 80657 64063 43245
126799 23365 13223 7588 5293 3748 2997 1077 437 379 657 -89 1839 1995 1784 1062 77 2006 2238
$$ packed form
266412B095J752p91j132J489j428J555L098n015j57m03p15K572L03m43k4M16Q72C348
244828I15J628J309Mk621K232K685k107n23n79r18K384P30q86j81r6j640J076B160
223052B633k585M644P30K48j225j03K091M8L506L302k782r41j901l332K516j47G148
202241H854P160K836J2106J5420J3437N610j862r994o948r536n554l763M3j430B5093
183594B1771m568k309p60j812j928j981n71k935l74J041J22l417J364n32K724G007
163627H286P074R427J8607L2652M0888L4210N275k2238l8847l5818k4838j2907A4178
147062A0570j294l52j460p91J780r34J36R47N387Q369J7498K2447J6263K091j6594D3245
126799B3365j0142n635k295j545p51j920o40n8K78p46J928J56k11p22r85J929B238
$$ plain form
105165 1780 4488 5215 6517 7066 8656 6788 6526 3554 2167 1139 1870 3069 2723 3461 2612 2905 2441
83345 4165 6546 5026 5863 5810 8015 8805 9845 10221 12010 14402 19239 22659 25847
$$ packed form
105165A780K708P27J302N49J590j868k62k972j387j028P31J199l46P38q49K93B441
83345D165K381j520Q37n3K205P90J040L76J789K392M837L420B5847
66244B6079  $$checkpoint
##END=