##TITLE= Raman spectrum of Hedenbergite (no. 5792) � http://rdrs.uaic.ro
##MINERAL= Hedenbergite
##CHEMISTRY= CaFe++Si2O6
##JCAMP-DX= 5.01
##DATA TYPE= RAMAN SPECTRUM
##DATA CLASS= XYDATA
##ORIGIN= Department of Geology, UAIC, Romania
##OWNER= http://rdrs.uaic.ro � stud. Apopei Andrei Ionut
##LONGDATE= 2010/09/11 18:35:49.0357 +0300 $$ export date from JSpecView
##SPECTROGRAPHDATASYSTEM= HE 532 (Horiba Jobin-Yvon)
##XUNITS= Raman shift (1/cm)
##YUNITS= Intensity (cnt)
##XFACTOR= 3.188909E-3
##YFACTOR= 1.67744178E-4
##FIRSTX= 3399.61
##FIRSTY= 0.38880599
##LASTX= 210.701
##NPOINTS= 1024
##XYDATA= (X++(Y..Y))
1066073B318r51r50r52M36QPPOPOOOONNNNNNMMMMMLMLLLLLKLKKKKKJKJKJJJJJ%E9
1027041F0%%J%%%%%%%j%%j%jj%jjjjjjjjjjjjkjjjkjjkjkjkjkjkjkjkjkjkjkjkB
979075Akjkjkjkjkjjkjkjjkjjjkjjjkjjjjjjjjjjjjj%jjj%jj%j%j%j%j%j%%%je8
929017e8%%j%%%%%J%%%%%J%%J%%J%J%J%J%JJ%JJ%JJJJ%JJJJJJJJJJJJJJJKJJJb3
878460b2KJJJKJJJKJJKJJKJJKJJKJJKJKJJKJJKJJKJJKJJKJJJKJJJKJJJJJKJJJE4
826562E5JJJJJJJJ%JJJJ%JJJ%JJ%J%J%J%%J%%J%%%%J%%%%%%j%%%%j%%j%%j%jjG2
773271G1j%jjj%jjjjjjjkjjjjkjjkjkjkjkkjkkjkkkkjkkkkkkkklkkkkklkkklkb3
718544b6kklkklkklklkklklkklklkkklkklkkkkklkkkkkjkkkjkkjkjkjjjkjj%ja42
$$ y = [2318, 1367, 417, -535, -99, -91, -84, -77, -71, -64, -58, -52, -46, -40, -35, -30, -25, -20, -15, -10, -6, -2, 2, 6, 10, 13, 17, 20, 23, 26, 29, 32, 34, 37, 39, 41, 43, 45, 47, 48, 50, 51, 53, 54, 55, 56, 57, 58, 58, 59, 60, 60, 60, 61, 61, 61, 61, 61, 61, 61, 61, 60, 60, 60, 59, 59, 58, 57, 57, 56, 55, 54, 53, 52, 51, 50, 49, 48, 47, 46, 45, 43, 42, 41, 40, 38, 37, 36, 34, 33, 31, 30, 28, 27, 25, 24, 22, 21, 19, 18, 16, 15, 13, 12, 10, 9, 7, 6, 4, 2, 1, -1, -2, -4, -5, -7, -8, -10, -11, -13, -14, -15, -17, -18, -20, -21, -22, -24, -25, -26, -27, -29, -30, -31, -32, -34, -35, -36, -37, -38, -39, -40, -41, -42, -43, -44, -45, -46, -47, -47, -48, -49, -50, -50, -51, -52, -52, -53, -53, -54, -54, -55, -55, -56, -56, -57, -57, -57, -57, -58, -58, -58, -58, -58, -59, -59, -59, -59, -59, -59, -58, -58, -58, -58, -58, -58, -57, -57, -57, -56, -56, -56, -55, -55, -54, -54, -53, -53, -52, -52, -51, -50, -50, -49, -48, -48, -47, -46, -45, -44, -44, -43, -42, -41, -40, -39, -38, -37, -36, -35, -34, -33, -32, -31, -30, -29, -27, -26, -25, -24, -23, -22, -20, -19, -18, -17, -15, -14, -13, -12, -10, -9, -8, -6, -5, -4, -2, -1, 0, 2, 3, 4, 6, 7, 8, 10, 11, 13, 14, 15, 17, 18, 19, 21, 22, 23, 25, 26, 27, 29, 30, 31, 33, 34, 35, 36, 38, 39, 40, 41, 43, 44, 45, 46, 47, 48, 50, 51, 52, 53, 54, 55, 56, 57, 58, 59, 60, 61, 62, 63, 63, 64, 65, 66, 67, 67, 68, 69, 70, 70, 71, 72, 72, 73, 73, 74, 74, 75, 75, 75, 76, 76, 76, 77, 77, 77, 77, 77, 78, 78, 78, 78, 78, 78, 78, 77, 77, 77, 77, 77, 76, 76, 76, 75, 75, 75, 74, 74, 73, 72, 72, 71, 70, 70, 69, 68, 67, 67, 66, 65, 64, 63, 62, 61, 60, 58, 57, 56, 55, 54, 52, 51, 50, 48, 47, 45, 44, 42, 41, 39, 37, 36, 34, 32, 31, 29, 27, 25, 23, 22, 20, 18, 16, 14, 12, 10, 8, 6, 3, 1, -1, -3, -5, -7, -10, -12, -14, -16, -19, -21, -23, -26, -28, -30, -33, -35, -37, -40, -42, -44, -47, -49, -52, -54, -56, -59, -61, -64, -66, -68, -71, -73, -76, -78, -80, -82, -85, -87, -89, -92, -94, -96, -98, -100, -102, -105, -107, -109, -111, -113, -115, -116, -118, -120, -122, -123, -125, -127, -128, -130, -131, -133, -134, -135, -136, -138, -139, -140, -140, -141, -142]
662336a43%j%j%%%%%J%%JJJJJJJKKJKKLKLKLLLMLMMMNMNNNNOOOOPOPQPQQQRRRE8
605568F8J0J0J1J1J1J1J2J2J3J3J3J4J4J4J5J5J5J6J6J7J7J7J8J9J8J9K0K0K1E21
575131E42K2K2K3K4K4K4K5K6K6K6K7K8K8K9L0L0L0L2L1L3L3L4L4L5L6L6L8L7L9A443
544265A483M1M1M2M3M4M5M5M6M7M8M8N0N0N1N2N3N4N5N5N7N7N9N9O1O1O3O3O5C003
513975C070O7O9P0P1j13j21j20j18j18j16j16j14j13j12j11j09j09j07j06j04A436
491500A334j00j00r8r7r5r4r3r1r0q8q7q5q4q2q1p9p8p6p5p2p2o9o8o6Q5J35J37a90
461525d9J43J45J47J48J51J53J55J57J59J61J63J66J67J70J72J75J77J79J81j53B867
438520B867%%%%%%%%%%%%%%%%%%%%%%%%%%%%%%%%%%%%%%%%%%%%%%%%%%%%%%%%B867
$$ y = [-143, -143, -144, -144, -145, -145, -145, -145, -145, -145, -144, -144, -144, -143, -142, -141, -140, -139, -138, -137, -135, -133, -132, -130, -128, -125, -123, -120, -118, -115, -112, -109, -105, -102, -98, -94, -90, -85, -81, -76, -71, -66, -61, -55, -49, -43, -37, -30, -24, -17, -9, -2, 6, 14, 22, 31, 40, 49, 58, 68, 78, 88, 99, 110, 121, 132, 144, 156, 169, 182, 195, 209, 223, 237, 252, 267, 282, 298, 314, 331, 348, 365, 383, 402, 420, 439, 459, 479, 500, 521, 542, 564, 586, 609, 633, 657, 681, 706, 732, 758, 784, 811, 839, 867, 896, 926, 956, 986, 1018, 1049, 1082, 1115, 1149, 1183, 1218, 1254, 1290, 1328, 1365, 1404, 1443, 1483, 1524, 1565, 1607, 1650, 1694, 1739, 1784, 1830, 1877, 1925, 1973, 2023, 2073, 2124, 2176, 2229, 2283, 2338, 2393, 2450, 2507, 2566, 2625, 2686, 2747, 2810, 2873, 2938, 3003, 3070, 3137, 3206, 3276, 3347, 3234, 3113, 2993, 2875, 2757, 2641, 2525, 2411, 2298, 2186, 2075, 1966, 1857, 1750, 1644, 1540, 1436, 1334, 1234, 1134, 1036, 939, 844, 750, 657, 566, 476, 388, 301, 216, 132, 50, -31, -110, -188, -264, -339, -411, -483, -552, -620, -686, -601, -466, -329, -190, -49, 94, 239, 386, 534, 685, 838, 993, 1150, 1309, 1470, 1633, 1799, 1966, 2136, 2308, 2483, 2660, 2839, 3020, 2867, 2867, 2867, 2867, 2867, 2867, 2867, 2867, 2867, 2867, 2867, 2867, 2867, 2867, 2867, 2867, 2867, 2867, 2867, 2867, 2867, 2867, 2867, 2867, 2867, 2867, 2867, 2867, 2867, 2867, 2867, 2867, 2867, 2867, 2867, 2867, 2867, 2867, 2867, 2867, 2867, 2867, 2867, 2867, 2867, 2867, 2867, 2867, 2867, 2867, 2867, 2867, 2867, 2867, 2867, 2867, 2867, 2867, 2867, 2867]
376740B867%%%%%%%%%%%O49O17O18O18O19O18O19O20O19O20O20O21J064j853R84A1650
346316A2044L94L94L95L94J679L552%%N939J166%%J6303J1709J1608J4042K4813A22813
325444A52058K086j088O644M7698J47552K90143L00616N3605k34111l33651j97842A44134
311058I5990l3566j1311k1391M294q167j375o145l473j2520M269m715j729O426E049
294350D522m183K516k582R821k876N188J217N678R41j009r112J1390O07O476l884A3912
275273A9998K619k947O558J0346J0169K0286J2230q173k4407k9675j0973P136G248
259447B298P314J123R17l504n998o2P66P516j651l142L234Q51r993N423N248K444A9065
238947A5945J0823k0417J0461k244n017M492M477k400n877J6588o096p754L164B0002
$$ y = [2867, 2867, 2867, 2867, 2867, 2867, 2867, 2867, 2867, 2867, 2867, 2867, 3516, 4133, 4751, 5369, 5988, 6606, 7225, 7845, 8464, 9084, 9704, 10325, 11389, 9536, 10520, 11650, 12044, 12438, 12832, 13227, 13621, 15300, 18852, 18852, 18852, 24791, 25957, 25957, 25957, 42260, 53969, 65577, 79619, 104432, 122813, 152058, 154144, 153056, 159700, 207398, 354950, 645093, 945709, 999314, 765203, 431552, 233710, 144134, 95990, 62424, 51113, 29722, 34016, 25849, 24474, 18329, 14856, 2336, 6605, 1890, 161, 6587, 5049, 4522, 339, 2855, 273, 10094, 7218, 12406, 13623, 19301, 20242, 19233, 10121, 21511, 22118, 28594, 24710, 13912, 19998, 22617, 19670, 26228, 36574, 46743, 67029, 79259, 71086, 46679, 17004, 6031, 13167, 7248, 2298, 9612, 10735, 11652, 8148, 2150, 2088, 2854, 10370, 8719, 5577, 8811, 9662, -331, 5092, 10340, 12784, 19065, 15945, 26768, 6351, 16812, 14568, 9551, 14043, 18520, 16120, 10243, 26831, 20735, 12981, 16145, 20002]
221731A5838J212J4310k184k950J7497O910J9962M4013P7449J33823J89366J20449F33555
205552D98751j71790j31098n8964k5400k9924j5490k166p035k799q497m464J151C8998
189267D2778j3759M764J66j425K609o125o995Q821J0537L542J2295K0746J5806H2438
171699F8088k1468j0727q114q83N081n481Q786j1398R44j879n108o304J698M549A3164
152821A5765p569J110P406M004o477l062J0945j716P937l7q089M853n957J2548B9737
133799A9384K389n615Q785L400J0909M553N434L2056M5474O0047M6911J8935k4958A84626
115835A32454k8901O141J0079L7256L4585J2814r796k0801k4815j6331j2232J6594A46255
98952A56731q971n386l2179j7360j6110p854j4824j4781J452q652n754j570J55B1309
$$ y = [15838, 17050, 31360, 29176, 26226, 43723, 50633, 70595, 114608, 192057, 325880, 515246, 635695, 633555, 498751, 326961, 195863, 136899, 111499, 81575, 66085, 63919, 56884, 54085, 45588, 41124, 42275, 38998, 42778, 29019, 33783, 33949, 32524, 35133, 29008, 22013, 30834, 41371, 44913, 57208, 77954, 93760, 82438, 68088, 46620, 35893, 27779, 26896, 31977, 26496, 35282, 23884, 24828, 22949, 17841, 11537, 13235, 17784, 13164, 15765, 8196, 9306, 16712, 20716, 14239, 11177, 22122, 20406, 28343, 28306, 20217, 25070, 19113, 31661, 29737, 19384, 21773, 16158, 24943, 28343, 39252, 43805, 49239, 81295, 126769, 186816, 233727, 252662, 227704, 184626, 132454, 103553, 109694, 119773, 157029, 191614, 204428, 194632, 173831, 149016, 132685, 120453, 137047, 146255, 156731, 147760, 142374, 110195, 92835, 76725, 68871, 54047, 39266, 40718, 32066, 26312, 24742, 24897, 21309]
80739B0246n178N334k05l74o339P79l243m1j397m710A248
$$ y = [20246, 15068, 20402, 20197, 19823, 13484, 14263, 11020, 10979, 9582, 4872, 1248]
66073a  $$checkpoint
##END=