##TITLE= Raman spectrum of Hedenbergite (no. 5799) � http://rdrs.uaic.ro
##MINERAL= Hedenbergite
##CHEMISTRY= CaFe++Si2O6
##JCAMP-DX= 5.01
##DATA TYPE= RAMAN SPECTRUM
##DATA CLASS= XYDATA
##ORIGIN= Department of Geology, UAIC, Romania
##OWNER= http://rdrs.uaic.ro � stud. Apopei Andrei Ionut
##LONGDATE= 2010/09/11 18:34:44.0589 +0300 $$ export date from JSpecView
##SPECTROGRAPHDATASYSTEM= HE 532 (Horiba Jobin-Yvon)
##XUNITS= Raman shift (1/cm)
##YUNITS= Intensity (cnt)
##XFACTOR= 3.188909E-3
##YFACTOR= 4.15229621E-4
##FIRSTX= 3399.61
##FIRSTY= -0.11714264
##LASTX= 210.701
##NPOINTS= 1024
##XYDATA= (X++(Y..Y))
1066073b82J366l562J124k011O435l203J612j478J090J38J216j832J710k938K830A650
$$ -282 1084 -2478 -1354 -3365 3070 -133 1479 1 1091 1229 2445 613 2323 -615 2215 1650
1052896B921k880K758k04J718k541J693k10k33R10n82j339j622o7K005Q80N98l853H06
$$ 2921 41 2799 2595 4313 1772 3465 3255 3022 3932 3350 2011 389 322 2327 3207 3805 -48 806
1038054A768J026k73P64j744J042r46p97J947J513j469J424l48j796k85O21K371C882
$$ 1768 2794 2521 3285 1541 2583 1637 840 2787 4300 2831 4255 3907 2111 1826 2447 4818 3882
1023883D026m19j18j134N73K69j914M113l968J282J519J647l149K316l281N448b5
$$ 4026 3607 3489 2355 2928 3197 1283 5396 1428 2710 4229 5876 2727 5043 1762 7210 -25
1010396E011l305q20K766r73O48l25J71j53q24J9K892l223J68J292r33k43J399H163
$$ 5011 1706 886 3652 2679 3327 3002 3173 3020 2196 2215 5107 1884 2052 3344 2411 2168 3567 8163
995202F105j541k728L061j606K045j260J915m891N977k298J180l487J914k493G804
$$ 6105 4564 1836 4897 3291 5336 4076 5991 1100 7077 4779 5959 2472 4386 1893 7804
982311E419k062j586O39J309K562j630N96k818J698j61Q34k321Q33rk321q08Q55B857
$$ 5419 3357 1771 2410 3719 6281 4651 5247 2429 4127 3966 4800 2479 3312 3303 982 174 1029 2857
966889B956J893Q99j477rl659L794m329K499K585j58N7j930K997m803P49j000A123
$$ 2956 4849 5748 4271 4262 603 4397 68 2567 5152 4994 5051 3121 6118 1315 2064 1064 1123
952160C472o53n67r2K955L9j99k575K395j214j148J207O738l286k573j990L456C868
$$ 3472 2819 2252 2160 5115 5154 4955 2380 4775 3561 2413 3620 10358 7072 4499 2509 5965 3868
937314D688l263J058j144K182K961k224j597o3L459j445j423K41Ll85K230k11C322
$$ 4688 1425 2483 1339 3521 6482 4258 2661 2598 6057 4612 3189 3430 3433 3048 5278 5067 3322
922350F071j420j635O76k694K363p92J413l103K991k108l79K05m43J890K713l337A948
$$ 6071 4651 3016 3692 998 3361 2569 3982 879 3870 1762 1383 1588 1145 3035 5748 2411 1948
907273D294L80k644J808K002k557m9K414k426n02j020L453J47K56l27p37l805d9
$$ 4294 4674 2030 3838 5840 3283 3234 5648 3222 2720 1700 5153 5300 5556 5229 4492 687 -49
892073B521O4q43j318L544J95J816l844j229N728l454J084q3n57j47O53j182o43C068
$$ 2521 2585 1742 424 3968 4163 5979 2135 906 6634 3180 4264 4181 3624 3477 4130 2948 2305 3068
875898D609k413j721K277j288K04J457K408k972J134K755k214k300N047l812J007D083
$$ 4609 2196 475 2752 1464 1668 3125 5533 2561 3695 6450 4236 1936 6983 3171 4178 4083
861313D961k816O84l95M04P07M230k317O65q90r33k272q46P97L109l114K58K548B338
$$ 4961 2145 2829 2434 2838 3545 7775 5458 6123 5233 4300 2028 1182 1979 5088 1974 2232 4780 2338
844881B942J664J469k224J059j489K61j446j27P59J040N22k092M174k761M823E208
$$ 2942 4606 6075 3851 4910 3421 3682 2236 2109 2868 3908 4430 2338 6512 3751 8574 5208
830064D716k10p50j420M112J563l385K9p8j958K212J392l037k367M439k71L77C171
$$ 4716 4506 3756 2336 6448 8011 4626 4655 4577 2619 4831 6223 3186 819 5258 4987 5364 3171
814253C744J502j0j047k840n2n71K389K606l378M89q72J87q93L471n68K716j130D376
$$ 3744 5246 5236 4189 1349 1297 726 3115 5721 2343 2832 1960 2147 1254 4725 4157 6873 5743 4376
797426A497Q80J486j474J25k036M706k143K351m36j040O2J142j386l719J986p37B580
$$ 1497 2377 3863 2389 2514 478 5184 3041 5392 4956 3916 3978 5120 3734 15 2001 1264 2580
781355B751j017j146L348r74L89N39J037l825L004k917l02L911k59j943O92J924C161
$$ 2751 1734 588 3936 2962 3351 3890 4927 1102 4106 1189 887 4798 4539 2596 3288 5212 3161
765155B060J882k36j986L265j229O50k331N86N87J126Q68k720L850m29j811N01E285
$$ 2060 3942 3706 1720 4985 3756 4406 2075 2661 3248 4374 5242 2522 6372 5943 4132 4633 5285
748824F413m93R12k178R1L008j032K425j897j89L51j658L419j874k565K663j269E680
$$ 6413 5920 6832 4654 4745 7753 6721 9146 7249 7060 7411 5753 9172 7298 4733 7396 6127 5680
732363F269M414q36J130l82k651j484j268L961l752r00N47K751k023J974L53l233F585
$$ 6269 10683 9847 10977 10595 7944 6460 5192 9153 5401 4501 5048 7799 5776 7750 8103 4870 6585
715768G241k95K25m03o61j483L811l448L0M20j115N108j612Q74j849o82L444j352E951
$$ 7241 6946 7171 6768 6107 4624 8435 4987 5017 5437 4322 9430 7818 8692 6843 6161 9605 8253 5951
698110F868R6m22K04M547l900p90o81J479l014k453L035Q75K280P88j631R7j83H264
$$ 6868 6964 6542 6746 11293 7393 6603 5922 7401 4387 1934 4969 5844 8124 8912 7281 7378 7195 8264
680298G692M22k884l2K129n50J459J675l142m64K216j349Q55O39j241k90j241H132
$$ 7692 8114 5230 5198 7327 6777 8236 9911 6769 6305 8521 7172 8027 8666 7425 7135 5894 8132
663286I139j240k04L59j996K044M24P91j38j196l033M811P8o77o99J181j80n474G289
$$ 9139 7899 7695 8054 6058 8102 8526 9317 9179 7983 4950 9761 9839 9162 8463 9644 9464 3990 7289
645177I810k686J182k016k254O85K889j367J679j929K004J312o32j216J032K437G208
$$ 9810 7124 8306 6290 4036 4721 7610 6243 7922 5993 7997 9309 8677 7461 8493 10930 7208
628842D092K998k057J940j063j733J120K373j55O1J012p60k618K590j062K417F214
$$ 4092 7090 5033 6973 5910 4177 5297 7670 7515 7576 8588 7828 5210 7800 6738 9155 6214
612382E844o7K634J726k227j968J252K14J29Q5j794M320q43j016J232j707j621H268
$$ 5844 5777 8411 10137 7910 5942 7194 7408 7537 7622 5828 10148 9305 8289 9521 7814 6193 8268
594818G533K140k138k030J643L177O29L69m666J104j812L070O51J299l194j877H775
$$ 7533 9673 7535 5505 7148 10325 10954 11323 6657 7761 5949 9019 9670 10969 7775 5898 8775
578097G590k459L482p52k98J107k826J582P62j551Ol83r23k133p07L399k435J952H013
$$ 7590 5131 8613 7861 7563 8670 5844 7426 8188 6637 6643 6260 5337 3204 2497 5896 3461 5413 8013
559254D088l6J089J110l125L0l4J305L1J068l729N023l274J263J696j891l2K733C956
$$ 4088 4052 5141 6251 3126 3156 3122 4427 4458 5526 1797 6820 3546 4809 6505 4614 4582 7315 3956
540251B649K497k214J914r6L318k731J979Q99l184l0J548m502M876j109O63N33D714
$$ 2649 5146 2932 4846 4750 8068 5337 7316 8215 5031 5001 6549 2047 6923 5814 6477 7010 4714
522094F587k945J874J46j14K54o10R68Q59O22k510L172n492J8N160m152N183l482F896
$$ 6587 3642 5516 5662 5548 5802 5192 6160 7019 7641 5131 8303 2811 2829 7989 3837 9020 5538 6896
502768D431L325r75M09j882O46L45l200L67L66j557J836k896K009Q6N84J750k852B122
$$ 4431 7756 6781 7190 5308 5954 6299 3099 3466 3832 2275 4111 1215 3224 3310 3894 5644 2792 2122
483272F358l478K636k786k030K334k397M085m730N144k570KO28L04k35M085m362D503
$$ 6358 2880 5516 2730 700 3034 637 4722 -8 5136 2566 2568 3196 3500 3265 7350 2988 4503
464645B366j337m51J666J904K336l390L546p32j661r91J883k893J926N00l821E175
$$ 2366 1029 578 2244 4148 6484 3094 6640 5908 4247 3256 5139 2246 4172 4672 851 5175
446911B671j769K41K358L200l757N65L913l649L05K83L49J75L243l131k720O28E284
$$ 2671 902 1143 3501 6701 2944 3509 7422 3773 4078 4361 4710 4885 8128 4997 2277 2905 5284
427986C600J536k159j93J146j922L868Q87l068n82N380m516M191k160l04k658D860
$$ 3600 5136 2977 2784 3930 2008 5876 6763 3695 3113 8493 3977 8168 6008 5704 3046 4860
409965E529l956L758O3j817J467J574J034n167J077L41k273M793j194j755Q1J398D882
$$ 5529 1573 5331 5394 3577 5044 6618 7652 2485 3562 3903 1630 6423 5229 3474 3555 4953 4882
390729E718l09K09R86N32k580j176p22K583l316j891M181o81j719J802n10k563B172
$$ 5718 5409 5618 6604 7136 4556 3380 2658 5241 1925 34 4215 3534 1815 3617 3107 544 2172
371334C519n55m70k522K554p73J927r04J148k79L502k095o91J512K981J144l26I777
$$ 3519 2964 2494 -28 2526 1753 3680 2776 3924 3645 7147 5052 4361 5873 8854 9998 9672 9777
351779I752J919k42J723J528j022j606M637J050j738L101O81p25Q74M005l81L356B7869
$$ 9752 11671 11429 13152 14680 13658 12052 16689 17739 16001 19102 19783 19058 19932 23937 23556 26912 27869
332054C2498N450N233M756J1843J0178J7978J2034K1779K7827P2919J74079L09960I96635
$$ 32498 37948 43181 47937 59780 69958 87936 99970 121749 149576 222495 396574 706534 996635
316604I95877k75596l18247j93104q7730m1926k6349j0080r087m248m313k889A9700
$$ 995877 720281 402034 208930 121200 79274 52925 42845 33758 29510 25197 22308 19700
302162A7134m50j185k158j057k0N61k766J900L951J055K308j647K10j757K694A9952
$$ 17134 16684 15499 13341 12284 12264 12825 10059 11959 15910 16965 19273 17626 17836 16079 18773 19952
283147B1629l078M202J328k519l448L054k370l7K642j659O183Q905J1929Q320E1020
$$ 21629 18551 22753 24081 21562 18114 21168 18798 18761 21403 19744 25927 34832 46761 55081 51020
265111C9699j7868l069r530J985O24J466O66j388j669K393l852K802l075K283A1545
$$ 39699 21831 18762 9232 11217 11841 13307 13973 12585 10916 13309 9457 12259 9184 11467 11545
246940A2855P04j241n3p88J438j1L554o082M483k021M42P88m01l663M699J759A3707
$$ 12855 13559 12318 12265 11477 12915 12904 16458 10376 14859 12838 13280 14068 13667 10004 14703 16462 13707
226334A4818Q75K495M483N217L922K344j392L965L815J4187K1792L7890Q3674C32707
$$ 14818 15693 18188 22671 27888 31810 34154 32762 36727 40542 54729 76521 114411 198085 332707
209028D94705J15567k5219j30700j69352j19613o6808l6060j7651j1275m382n828A8378
$$ 494705 610272 585053 454353 285001 165388 98580 62520 44869 33594 29212 23384 18378
193931A4087j719l510o57k535j78j558l47J189m772L851o63J868L015n47O455A2681
$$ 14087 12368 8858 8201 5666 5488 3930 3583 4772 0 3851 3188 5056 8071 7524 13979 12681
174048A5664k157j88Q52j629N417J1514J2598L786n32q112n105j601r05j484l274A5352
$$ 15664 13507 13319 14171 12542 17959 29473 42071 45857 45325 37213 32108 30507 29602 28118 24844 15352
154005A2715n162j375m201j625K227n34j83K069l931L853K649L606j487m592Q81D307
$$ 12715 7553 6178 1977 352 2579 2045 1862 3931 0 3853 6502 10108 8621 4029 4910 4307
133799G989j734O461J305K134M972J3471J9010L6563O9240R1524R2073M2150k1341B96636
$$ 7989 6255 12716 14021 16155 21127 34598 53608 90171 159411 250935 343008 385158 363817 296636
115835B17063n9038k8108q395J815J3450K505m181q557j154N294K6071L7188L8152B58191
$$ 217063 158025 129917 121522 123337 136787 139292 135111 126554 125400 130694 156765 193953 232105 258191
97742B59701l5293m6061l8291l1450j6678j5152j1529o630n536k689J13j015D6546
$$ 259701 224408 178347 140056 108606 91928 76776 65247 58617 53081 50392 50505 49490 46546
80739D7119k435R206k378O973L340K256N775k610j770q7F7613
$$ 47119 44684 53890 51512 58485 61825 64081 69856 67246 65476 65389 67613
66073G3812  $$checkpoint
##END=