##TITLE= Raman spectrum of Hematite � http://rdrs.uaic.ro
##MINERAL= Hematite
##CHEMISTRY= Fe2O3
##JCAMP-DX= 5.01
##DATA TYPE= RAMAN SPECTRUM
##DATA CLASS= XYDATA
##ORIGIN= Department of Geology, UAIC, Romania
##OWNER= http://rdrs.uaic.ro � stud. Apopei Andrei Ionut
##LONGDATE= 2010/06/01 14:22:00.0440 +0300 $$ export date from JSpecView
##SPECTROGRAPHDATASYSTEM= HE 532 (Horiba Jobin-Yvon)
##XUNITS= Raman shift (1/cm)
##YUNITS= Intensity (cnt)
##XFACTOR= 3.188909E-3
##YFACTOR= 1.46113533E-3
##FIRSTX= 3399.61
##FIRSTY= -0.0162391
##LASTX= 210.701
##NPOINTS= 1024
##XYDATA= (X++(Y..Y))
$$ plain form
1066073 -11 3159 366 3539 2529 4147 7502 2845 6914 4485 1300 4705 3036 4127 4240 3464 2688
1052896 3515 4922 3347 615 4606 3567 658 4828 4503 1818 246 4106 6942 5461 8564 6860 6269
1039622 3497 4687 7124 5108 5898 3393 7075 4570 4157 6815 3909 1670 6731 10056 9463 8870 6674
1026251 7461 9003 4447 4030 4324 6177 6827 3024 9148 4098 5725 6951 4882 5349 8220 6371 6970
1012782 5966 8121 5780 3215 3454 5562 4641 5590 3333 4591 8475 5280 7872 6010 4237 4377 5050
999213 6346 4702 4393 5285 5909 3816 -59 4301 158 5317 2017 5348 3470 4129 7057 5131 5386
985544 7197 7049 5519 7906 2769 8180 3530 4443 7803 6578 6730 3588 5831 5357 1142 4049 5753
971774 4963 3504 4447 6057 6241 3442 2867 5318 5542 7769 6210 4828 2999 4642 5749 2938 5512
$$ packed form
1066073a1L170k793L173j010J618L355m657M069k429l185L405j669J091J13p76B688
1052896C515J407j575k732L991j039k909M170l25k685j572L860K836j481L103j704F269
1039622C497J190K437k016P90k505L682k505m13K658k906k239N061L325n93n93F674
1026251G461J542m556m17K94J853O50l803O124n050J627J226k069M67K871j849F970
1012782E966K155k341k565K39K108r21R49k257J258L884l195K592j862j773J40E050
999213F346j644l09Q92O24k093l875M360m143N159l300L331j878O59K928j926E386
985544G197j48j530K387n137N411m650R13L360j225J52l142K243m74m215K907E753
971774D963j459R43J610J84k799n75K451K24K227j559j382j829J643J107k811E512
$$ plain form
957901 6349 6383 -83 6136 4565 5128 5112 4873 7214 5369 6773 5861 6328 3321 1427 3315 3465 5663 3986
942275 4045 7397 3981 5104 6539 4811 2504 4736 2605 4124 7644 3106 6847 4533 1950 3596
929017 2303 -149 1717 3136 3353 6062 4985 8182 6837 3933 3744 5290 4609 2948 441 3452 3970
914827 1238 4648 4451 2518 3165 3545 764 3324 3345 2743 3297 4697 3648 5046 6711 4636 1536 2487
899687 2680 157 2308 1298 6253 523 3562 6334 2027 4219 6499 6954 4248 3767 2663 6544 8466
885278 6426 5364 5237 6624 6674 6190 6597 6335 4826 5899 11290 3504 7870 6850 10816 5789 5614 5128
869906 6244 6469 9588 7276 7456 8661 6571 10090 9158 5999 5601 4713 1644 8902 7970 8774 7530 4950
854411 6200 9808 9811 10215 10129 9509 7910 10985 7517 11883 9350 12337 12698 13549 18896 14761 16147 16642 18652
$$ packed form
957901F349L4o466O219j571N63j6k39K341j845J404r12M67l007j894J888J50K198C986
942275D045L352l416J123J435j728k307K232k131J519L520m538L741k314k583C596
929017B303k452J866J419K17K709j077L197j345k904j89J546o81j661k507L011C970
914827A238L410j97j933O47L80k781K560K1o02N54J400j049J398J665k075l100B487
899687B680k523K151j010M955n730L039K772m307K192K280M55k706m81j104L881H466
885278F426j062j27J387N0m84M07k62j509J073N391p786M366j020L966n027j75E128
869906F244K25L119k312J80J205k090L519r32l159l98q88l069P258r32Q04j244D950
854411F200L608LM04q6o20j599L075l468M366k533K987L61Q51N347m135J386M95A8652
$$ plain form
837923 17902 20936 19073 19927 22249 22658 22133 25481 26603 23942 26445 24274 25621 30841 29651 30331 28029
823053 24526 29526 26558 25504 23694 29497 26041 26459 25186 24536 22552 20612 17427 20252 18582 21408 15198
808069 18648 15912 19008 16762 12292 14321 14882 13218 15917 12118 14907 15873 17150 15000 11872 15422 12384
792973 8412 10139 11823 11414 11096 10912 6722 8275 11120 5953 7509 7196 8442 8531 9066 6530 11607 5156
776868 5872 8192 5082 5800 8568 6172 6715 760 5400 8706 8807 4369 8256 9161 6995 7190 6183 10787
760630 8936 6819 10223 6371 7952 4636 6664 5531 7871 12127 8192 9601 5490 5208 7331 9410 7528
745176 9520 7729 5938 5484 3206 9119 9825 6168 7187 8563 5711 5842 498 8198 6284 12294 21999
729607 19508 11365 5092 5853 3454 3237 8051 3428 3436 4914 6125 6179 5166 6735 5100 350 2455 6520
$$ packed form
837923A7902L034j863Q54K322M09n25L348J122k661K503k171J347N220j190O80B8029
823053B4526N000k968j054j810N803l456M18j273o50j984j940l185K825j670K826A5198
808069A8648k736L096k246m470K029N61j664K699l799K789R66J277k150l128L550A2384
792973H412J727J684m09l18j84m190J553K845n167J556l13J246Q9N35k536N077E156
776868E872K320l110P18K768k396N43n955M640L306J01m438L887R05k166J95j007A0787
760630H936k117L404l852J581l316K028j133K340M256l935J409m111k82K123K079G528
745176I520j791j791m54k278N913P06l657J019J376k852J31n344P700j914O010B1999
729607A9508q143o273P61k399k17M814m623QJ478J211N4j013J569j635m750K105F520
$$ plain form
712990 7959 11847 7189 1106 4061 4435 4810 5452 4625 8340 1015 5132 5242 9716 6845 7224 4132 6293
696241 7653 -23 7125 5593 5797 5735 7632 2452 4616 2419 6588 5237 6068 3427 6573 8518 5566
680298 4307 5095 7352 6895 11913 7271 6235 6446 9373 9896 6546 9117 7103 3932 8862 4890 7195
664233 2822 12605 6897 10760 8123 5798 3429 6490 5056 4155 2364 5915 5905 2689 6685 7965 8533
648046 5183 5884 2445 4036 5805 4769 4578 7281 5844 3471 8354 5447 6679 5195 4557 6723 11426
631733 7226 6408 11243 9667 9694 12124 14776 11061 13089 12979 14027 12224 14116 12401 14025 15559 14421
615295 10611 10763 14831 14715 12995 8692 11555 11524 5528 9680 7643 9479 9088 8562 9371 3457 6980 7297
597756 7123 5078 7885 5971 4859 5882 3387 5298 6451 8449 4214 7590 7091 7661 5602 5189 5844
$$ packed form
712990G959L888m658o083K955L74L75O42q27L715p325M117J10M474k871L79l092F293
696241G653p676P148j532K04o2J897n180K164k197M169j351Q31k641L146J945E566
680298D307P88K257m57N018m642j036K11K927N23l350K571k014l171M930l972G195
664233B822R783n708L863k637k325k369L061j434r01j791L551j0l216L996J280H533
648046E183P01l439J591J769j036j91K703j437k373M883k907J232j484o38K166A1426
631733G226q18M835j576K7K430K652l715K028j10J048j803J892j715J624J534A4421
615295A0611J52M068j16j720m303K863l1n996M152k037J836l91n26Q09n914L523G297
597756G123k045K807j914j112J023k495J911J153J998m235L376m99N70k059m13E844
$$ plain form
581055 4628 7639 5530 3019 5938 1911 3314 3202 5225 5022 3748 693 1108 3793 4295 4305 3380 2364
563233 11 4023 3047 2114 735 3984 2736 2732 1703 5347 6585 4038 5139 6596 8451 5898 6058 5015
545268 7710 7020 5928 9197 5163 8384 9422 9390 10113 12660 10575 9023 8493 12591 13437 9207 10095 11738
527152 10085 13906 11938 13351 10934 10475 11260 13111 12913 8796 16741 14624 13841 13990 16319 14240 17901
509908 17376 18718 19080 18950 19041 17528 22290 22108 18809 18046 19195 21589 21087 17690 19144 20729 22758 20645
491500 23561 24561 25337 24107 27461 34019 26864 27631 25369 26579 26718 26855 24364 25745 28726 26987 27829
473977 30583 25144 29987 31134 31122 32443 32295 27559 33862 32195 31328 36380 38314 37309 37905 41438 44301
456319 36836 42412 41755 44568 48226 48767 50286 51180 51983 55502 57950 63246 64490 72010 76145 83796 89754
$$ packed form
581055D628L011k109k511K919m027J403j12K023k03j274l055M15K685N02J0r25B364
563233A1M012r76r33j379L249j248mj029L644J238k547J101J457J855k553J60E015
545268G710o90j092L269m034L221J038l2P23K547k085j552n30M098Q46m230Q88A1738
527152A0085L821j968J413k417m59P85J851j98m117P945k117p83J49K329k079A7901
509908A7376J342L62j30R1j513M762j82l299p63J149K394n02l397J454J585K029B0645
491500B3561J000P76j230L354O558p155P67k262J210J39J37k491J381K981j739B7829
473977C0583n439M843J147j2J321j48m736O303j667q67N052J934j005N96L533D4301
456319C6836N576o57K813L658N41J519Q94Q03L519K448N296J244P520M135P651H9754
$$ plain form
438520 93174 108211 119152 127376 137825 155262 170161 191557 208858 231054 261396 290402 319897 359272
423756 406838 464999 519063 596631 664182 740813 829820 907251 960198 991821 999851 980280 906220
409965 837771 757166 666012 609669 557331 508643 479186 445767 417200 385517 364961 334480 317352
396088 290475 273572 252838 228232 206385 189569 181924 166310 162136 137219 138699 133280 123944 115187
381052 115377 110449 109260 106202 105771 93410 93781 95977 89895 82833 80402 72362 65703 57754 54746 49959
363748 49624 46530 44995 39721 38944 42620 46787 46102 56057 53549 61326 66788 69447 75446 76193 78099 78938
345222 79511 76123 75586 70598 71443 65434 72381 64817 69273 74043 79215 77889 77767 71770 79886 78032 65897
326547 74507 65892 60572 50625 44998 28910 25690 17130 14803 11366 10557 5342 8187 5068 5824 3956
$$ packed form
438520I3174J5037J0941Q224J0449J7437J4899K1396J7301K2196L0342K9006K9495C59272
423756D06838N8161N4064P7568O7551P6631Q9007P7431N2947L1623Q030j9571I06220
409965H37771q0605r1154n6343n2338m8688k9457l3419k8567l1683k0556l0481C17352
396088B90475j6903k0734k4606k1847j6816p645j5614m174k4917J480n419r336A15187
381052A15377m928j189l058m31j2361L71K196o082p062k431q040o659p949l008D9959
363748D9624l094j535n274p77L676M167o85R955k508P777N462K659N999P47J906G8938
345222G9511l388n37m988Q45o009O947p564M456M770N172j326j22n997Q116j854F5897
326547G4507q615n320r947n627j6088l220q560k327l437q09n215K845l119P56C956
$$ plain form
308838 42 2273 5351 5048 5816 6007 4063 8263 4053 6522 11084 5054 3344 -55 5895 3211 2043 7287
288755 7458 6340 9542 11811 7048 6916 11683 13158 10539 10325 15856 15112 21981 20795 18186 15935 22633
269633 21720 26818 17761 25934 30057 37965 33633 34777 38682 44770 46807 50315 47413 50611 41034 40360
251495 31719 29266 19113 13634 9936 8776 6102 10462 12463 7385 6181 9472 9914 11824 9995 6429
233221 4910 4502 1512 2928 3096 1972 2627 2168 15 5784 5764 6543 9991 15751 15988 16668 20283 27322 27859
211343 36850 44414 53086 53964 57464 57488 44463 33793 33669 25794 23833 30548 28353 33542 56264 83387
192766 102311 109209 88010 61373 42874 30421 18717 23608 16426 14221 14098 11117 8971 8595 5760
175222 2870 7446 5378 3164 6279 5019 6639 6153 12553 13686 19433 15105 22425 31064 51394 57106
$$ packed form
308838D2K231L078l03P68J91j944M200m210K469M562o030j710l399N950k684j168G287
288755G458j118L202K269m763j32M767J475k619k14N531p44O869j186k609k251B2633
269633B1720N098r057Q173M123P908m332J144L905O088K037L508k902L198r577D0360
251495C1719k453j0153n479l698j160k674M360K001n078j204L291M42J910j829F429
233221D910m08k990J416J68j124O55m59k153N769k0P79L448N760K37O80L615P039B7859
211343C6850P564Q672Q78L500K4j3025j0670j24p875j961O715k195N189K2722H3387
192766A02311O898k1199k6637j8499j2453j1704M891p182k205j23k981k146l76E760
175222B870M576k068k214L115j260J620m86O400J133N747m328P320Q639K0330E7106
$$ plain form
156371 54120 51027 31935 22618 12436 10826 13202 5809 -3 3246 10255 12346 18197 20686 20970 25413
137377 27249 29327 41171 71374 119711 197446 278535 301590 277427 208005 124308 79486 50033 44719
120638 39683 37683 40322 32196 34985 28966 37108 33060 35425 33520 38831 31279 36682 28684 30927 34281
101371 39323 48682 60662 77713 119953 172293 256586 291727 302107 277708 245420 199228 161704 141438
84392 131394 118129 108318 109573 131017 183336 216444 213515 188126 185904 204889 232571 231198 196764
67299 140886 115245
$$ packed form
156371E4120l093j9092r317j0182j610K376p393n812L249P009K091N851K489K84B5413
137377B7249K078J1844L0203M8337P7735Q1089K3055k4163o9422q3697m4822k9453D4719
120638C9683k000K639q126K789o019Q142m048K365j905N311p552N403p998K243C4281
101371C9323R359J1980J7051M2240N2340Q4293L5141J0380k4399l2288m6192l7524A41438
84392A31394j3265r811J255K1444N2319L3108k929k5389k222J8985K7682j373A96764
67299A40886A15245
##END=