##TITLE= Raman spectrum of Hyper Graphite � http://rdrs.uaic.ro
##MINERAL= Hyper Graphite
##CHEMISTRY= C
##JCAMP-DX= 5.01
##DATA TYPE= RAMAN SPECTRUM
##DATA CLASS= XYDATA
##ORIGIN= Department of Geology, UAIC, Romania
##OWNER= http://rdrs.uaic.ro � stud. Apopei Andrei Ionut
##LONGDATE= 2009/12/14 22:35:11.0546 +0200 $$ export date from JSpecView
##XUNITS= Raman shift (1/cm)
##YUNITS= Intensity (cnt)
##XFACTOR= 3.188736E-3
##YFACTOR= 5.53695692E-5
##FIRSTX= 3399.97
##FIRSTY= 0
##LASTX= 211.234
##NPOINTS= 1024
##XYDATA= (X++(Y..Y))
1066244@j032O059L175o056k010J561n341M340MJ112k268K774l886j379L876J670a5
1052288C86M733k899k079L367m217L121q990O532r7J059j142l166J897k280O170b07
1039007a629K598r74l697M397J306k716J474j230Q952J0582K623K1897r556q788C1122
1026419D1416k1926q693K3432o2P034J2020L678N404Q089j6365O555J9213k5666E4738
1014540E4676j4639p158j117q788k6860O925m368j454L288m85j838K745p144O217B032
1001783i90K502o156R309j1355P514k84k931L486j941J755q14R43Q99P91n300L841a9
987325g34R38J769j488j312J850L9l063J851L79l39p42L887m278J831r70M6J970b585
971940a234J237J489j689N28j021k48L114m312M038j908J994k444J018M47j06b72
$$ y = [0, -1032, 5027, 8202, 2146, 136, 1697, -3644, 696, 700, 1812, -456, 2318, -1568, -2947, 929, 2599, -15, 386, 5119, 2220, 141, 3508, -709, 2412, -6578, -46, -143, 916, -226, -3392, -1495, -3775, 2395, -207, -1629, 969, -5, -3702, 695, 2001, -715, 759, -471, 8481, 19063, 21686, 43583, 34027, 25239, 31122, 41416, 19490, 10797, 34229, 34167, 41201, 53221, 56899, 62303, 70392, 54027, 60582, 79795, 54129, 54738, 54676, 40037, 32879, 31762, 22974, -3886, 3039, -1329, -2783, 505, 20, -1818, 927, -6217, 0, 2032, -990, 1512, -4644, 4665, -6690, 824, 540, -2391, 1095, -846, 909, 95, 1038, 1937, 2728, -2572, 1269, -19, -734, 204, 1973, 485, -827, 1023, 1062, -2001, -150, 229, -110, -852, 3035, -1243, 588, -382, -336, 1634, -2585, -1234, 3, 1492, -197, 331, -690, -938, 2176, -2136, 1902, -6, 1988, -456, 562, 1009, 903, -272]
958069c9L86K219l614L146j882r06J418k215K383l010K308P00o42J060J379l510C44
943267A357j594J514l184J672M749o482K394n57J85R01N47j187K50k405J643O06B52
928352A5373J8189j6524J5984o168l1J1381K080j0004K367j5565q182r949K141D40
915830i97Q78k55J5K411J51j611O2o91J97p35K176j457Q07j941J555L578p059A772
899855e1j580l095M937J961j805J174o41m37j709K503k047J974k926K957r81m699B981
884595i8q51J172J805l426N061k693Q64k067R5O14o64K324k164J8338m619L6903E2112
869216D2123K573J4081J3410M972K2520Q711J4466n289K4247K0315J9069O7976B70641
857170C24905K6933K9713K7030M6688J9455K0891M2276J9745J4853K3001O127F07740
$$ y = [-39, 347, 2566, -1048, 2098, 216, -690, 728, -1487, 896, -2114, 194, 894, 252, 1312, 2691, -819, 344, 1357, -237, 1277, -1907, -235, 4514, -1968, 426, -131, 54, 955, 1502, 315, 565, -1840, -197, 409, 252, 15373, 33562, 17038, 33022, 26854, 26823, 38204, 40284, 30280, 32647, 17082, 8900, -1049, 1092, 440, -997, -119, -374, -359, 2052, 2203, 592, 654, -37, 160, -575, 1601, 144, 951, -990, 565, 4143, -2916, 1772, -51, -1631, -4726, 211, 2172, 367, 1541, 900, 463, -1246, 1257, -790, 1184, -1742, 1215, 234, -4465, 2981, -98, -949, 223, 2028, -1398, 3663, 970, 1834, -233, -138, 476, -188, 2136, -28, 18310, 13691, 50594, 52112, 42123, 44696, 58777, 72187, 77159, 99679, 108390, 122856, 117567, 141814, 162129, 181198, 249174, 270641, 324905, 351838, 381551, 408581, 455269, 474724, 495615, 537891, 557636, 572489, 595490, 601617, 607740]
845918F15784k8202k5713n9563j9763o1003l7218k6382l5971k5423k4559j5928B32650
834600B20079j5257k9161p105k6477q639k9160k982R869j830j1803n569k3022H1881
822342F9120J527j829j253q157l171Q57j1226j1801K583J8982k6856j3622M885B4829
809123C7195j4389K681j6786r977N67j553L057k566Q12J504j42j169R5O671n929f61
794032A373m083O329n736K598k144K784l421L631j742l213K158J3156J4114J4689C4277
779729C3336N099J8237j2354j325J1429j2163j709K797M524J1811J8812j4943E4361
767128E9172J8908k8657R893j9451R414m971m972q710j040m204q48k4534l755C505
753540a064K609l567j105N761p777O476j569M34Q17k730K665K257n447J851O7c658
$$ y = [615784, 587582, 561869, 502306, 482543, 421540, 384322, 357940, 321969, 296546, 271987, 256059, 232650, 220079, 204822, 175661, 168556, 142079, 133440, 104280, 101298, 111167, 109337, 97534, 91965, 68943, 81881, 69120, 70647, 68818, 67565, 59408, 56237, 57094, 45868, 34067, 36650, 55632, 28776, 15154, 20039, 24829, 37195, 22806, 25487, 8701, -1276, -709, -2262, 795, -1771, -959, 545, 403, -766, -671, 6000, 71, -661, 1373, -2710, 3619, -2117, 481, -1663, 1121, -2300, 1331, -411, -3624, -1466, 11690, 25804, 40493, 34277, 33336, 38435, 56672, 44318, 42993, 54422, 42259, 40550, 43347, 47871, 59682, 78494, 63551, 54361, 59172, 78080, 49423, 59316, 39865, 49279, 44308, 39336, 30626, 29586, 25382, 24534, 0, -3755, 3505, -1064, 1545, -2022, -3127, 2634, -5143, 1333, -236, 198, 1015, -1715, 950, 3207, -2240, -389, -322, -3658]
738032A472j669Q821K396P767M409N176J3520L8643k4072k7813m606n374K011A2717
724249I548j0011J789j436R19k550J770J078r05m560L894J526j740M413n757L705B428
708519b697P897q237M878j814o664O595m91J914j542k945O354l104J430j06N26D47
692669D891j3139J2177m873L714p392N479m76n76J055O54j514%O13r27j354M107a526
675754A614j614J909k505o2K56L16o64M161q116K943J119j403J725J181m493P095f
658703A058l335N532p034M189J747l624k501P092k213R34o139N132j018o16O381c499
642471c52K656n831K706L730o85j664P56l421L220o298P420r39k565L567K364G07
626113c549L875K705o881K955J375q21J581l022L037k21j771K371p61k555L87g17
$$ y = [1472, -197, 8624, 11020, 18787, 23196, 28372, 41892, 80535, 56463, 28650, 24044, 18670, 20681, 12717, 9548, -463, 1326, -110, 809, -1741, 29, 1107, 202, -4358, -464, 1062, -678, 3735, -2022, 1683, 2428, -2697, 5200, -3037, 1841, 27, -6637, -42, -533, 1381, -161, -3106, 3248, 144, 1574, 1468, 1994, 447, 4891, -8248, 3929, -944, 2770, -4622, 857, 381, -195, 860, 1514, 0, 0, 613, -314, -1668, 2439, -1526, 1614, 0, 1909, -596, -658, -402, -86, -750, 3411, -4705, -1762, -643, -2046, -321, 860, -3633, 3462, -6, 1058, -2277, 3255, -3779, 410, 2157, -1467, -3968, 3124, 911, 1845, -4294, 838, -180, -796, 5585, -3499, -352, 2304, -3527, -821, 2909, 2224, 560, 1316, -2105, 1115, -5183, 2237, 1298, -1267, 2300, 4664, 707, -3549, 326, 3031, -3850, -895, 480, -341, 1240, -1782, 1255, 1034, -737, 1634, 873, -1682, -1295, -717]
609633a575M805p163O890l521J079j291o17P82J928o049J942M438n060O943k112b550
593025A598n131Q213p054l19J459l941Q470r41m010k197N580n024Q316p892O955g912
576288A431m278J0359o765j337J258k877K209K602K054j780n403N018l094j5j864C152
559422e423R881r647O058Q71l266O670q998k386R044p696R919p467M956p162O771B792
542425c144L274K041l792J9959O663p817K732R444Q965j9516k639J6925M745p913B6330
526309D1432O855n420p721k351O567Q293n707J2608k159q489K0568p817J7020A12179
511093A23924J4335J5869L881j776m077K4787K4883N0008O3720J07833J37749G27853
497821I08375Q3377j011j28740j62403j94045j23853j14166n9505l7546m3012A04502
$$ y = [-1575, 3230, -3933, 2957, -564, 515, -776, -1393, -611, 1317, -4732, -2790, 1648, -3412, 3531, 1419, -2550, 1598, -3533, 4680, -2374, -2693, -1234, -5175, 3295, 2354, -1656, -3853, 1727, -3297, 5019, -2873, 4082, -7912, 1431, -2847, 7512, 747, -590, 668, -2209, 0, 2602, 4656, 2876, -2527, 2491, -603, -618, -2482, 3152, -5423, 4458, -5189, 869, 1740, -1526, 5144, -3854, -6240, 2804, -4892, 5027, -2440, 2516, -4646, 2125, 2792, -3144, 130, 2171, -1621, 18338, 25001, 17184, 19916, 29360, 38325, 18809, 16170, 33095, 37840, 29927, 26330, 41432, 48287, 42867, 35146, 32795, 39362, 47655, 41948, 54556, 52397, 43908, 64476, 56659, 73679, 112179, 123924, 138259, 154128, 158009, 156233, 152156, 176943, 201826, 251834, 315554, 423387, 561136, 727853, 908375, 991752, 990741, 862001, 699598, 505553, 381700, 267534, 208029, 170483, 127471, 104502]
485500F5134k448j6927N319j7407j202r160j3860K1143k1819O950m846q989k070F0
470001c099L566k68J599p07k327J066q80J184k58N418j0635N919j544K521m798H72
452311g65L525k963k6n7K20n25j097M891m298J903K4608M949q763r00K4801N718F1062
433426F4288J4158J5117K171K8256K0296K9983Q834O060n115l153o449j6864j5373A09765
417570A04940j8153j4031r619j562j3934L903j370j178j9110R467r232m725j3739I87
401604C051k538j021j753M311J80k216L94k65q20J519j4p93j839J012k073N228B02
382299a326R95K389k838J729k179K754j989K207j016j013L402o677K734k830Q872b247
363918B664l240n164O148J713j378J88q64M845p518J823o72K613j298J54j38L120c248
$$ y = [65134, 62686, 45759, 51078, 33671, 32469, 23309, 9449, 30592, 8773, 15723, 10877, 1888, -182, 60, -3099, 467, 199, 1798, 1091, -1236, -170, -1050, 134, -124, 5294, -5341, 578, -966, 1555, -3243, 872, -765, 2760, -203, -229, -286, -66, -591, -1688, 3203, -1095, 808, 25416, 30365, 21602, 20702, 45503, 51221, 61062, 64288, 78446, 93563, 95734, 123990, 144286, 174269, 183103, 189163, 184048, 180895, 174446, 157582, 142209, 109765, 104940, 86787, 72756, 63137, 61575, 47641, 51544, 50174, 48996, 29886, 39353, 30121, 25396, 11657, 987, 3051, 513, -508, -2261, 2050, 2230, 14, 408, 143, -677, 842, 828, 35, -1804, -792, -2865, 2363, 202, -1326, -331, 2058, -780, 949, -1230, 1524, -465, 1742, 726, -287, 3115, -3562, -828, -3658, 5214, -2247, 2664, -576, -5740, 408, 2121, 743, 931, 67, 4912, -2606, -783, -1455, 1158, -140, 14, -124, 2996, -3248]
344296A686m354L949j649J75n75O72M259l760m51J73J263p87J231k175K524j517b488
324511A99J791l073L82K62Q86j777J303K101k029J431j972K534k038K830l321B769
305671b40J76P76j413L011j420m42K00o48%r21O555p105M014k695k334L612j326b43
284438I35j280n21M05L244j914n42L58l21L471n001J427j539K723l860J322J528D56
264149i48R32j183K004j259L796q73l615R43k015J936R40k29k573L899k477J876E41
243687A61R37k622K602j330P16O4j86o42j3K41R9n46J91Q33j266R51p03P68k6H0
219595F55j67p89L99j82N52r94P07p75N02J7r2Kk16R43m44k8Lp7J30n42L97J8B36
191769G7m53P41p92J33N72l40L81j09j113N57j54J072J766l030J232o85R6l7Q6@
$$ y = [1686, -2668, 1281, -368, -193, -768, -96, 4163, 403, -48, 125, 1388, 601, 1832, -343, 2181, 664, -2488, 199, 1990, -1083, -701, -439, 447, -1330, -27, 2074, 45, 1476, -496, 2038, 0, 2830, -491, 2769, -240, -64, 712, -701, 2310, 890, 448, 648, 0, 0, -921, 5634, -1471, 2543, -152, -2486, 1126, -200, -243, 935, -345, -866, -461, 2783, 869, 327, 685, 364, 3835, -1166, 261, -1278, 1445, -2415, -1093, 435, 456, -948, -16, -1199, 805, -454, 3342, 2469, -1146, -203, -2218, -282, 658, 429, -2144, 1755, -722, 1154, 541, 161, 1098, -1524, 1078, -252, 464, 528, 342, -300, -313, -72, 27, -519, -328, 505, -761, 190, -513, 255, 229, 80, 655, 488, -301, 98, -84, 468, -526, 181, -594, -92, -75, -167, -165, -381, 562, 118, 90, 93, 16, 146, -396, 1, 19, 236, 77, -376, 365, -427, -294, 278, -62, 319, 210, -903, -346, -500, 572, 2338, -692, 540, -145, -49, -86, 0, 0]
167162A50K87p53K47J95k81L07l41J36k45L16p6p5P86l03j66J36P41o96q37J265B43
141119A61j86N29n04L47o49J211p29n72M11R1k40K29n73R71m97L33J41k1K37o35A05
114803D46j346J193j651K022o64p0P0%M90m90Q953K2284j0717J0471k68L9221A27962
93066A52316o627k1886L8146l9830j9026l6293o26k8920k842l4527M08J047j17E87
74809B8m05O08o3o9J778d78
$$ y = [150, 437, -316, -69, 126, -155, 152, -189, -53, -298, 18, -58, -133, 653, 350, 184, 320, 1061, 365, -472, 793, 243, 161, -25, 504, 0, 347, -302, 909, 180, -392, 19, 110, -130, 99, -474, 497, 0, 333, 474, 453, 690, 55, 105, 446, -900, 293, -1358, 664, 0, -70, 0, 0, 490, 0, 8953, 31237, 20520, 30991, 30723, 69944, 127962, 152316, 145689, 123803, 161949, 122119, 103093, 66800, 66174, 37254, 34412, -115, 293, 1340, 1223, 587, 28, -377, 231, 168, 99, 1877, -478]
66244C25  $$checkpoint
##END=