##TITLE= Raman spectrum of Hypersthene � http://rdrs.uaic.ro
##MINERAL= Hypersthene
##CHEMISTRY= (Mg, Fe++)2Si2O6
##JCAMP-DX= 5.01
##DATA TYPE= RAMAN SPECTRUM
##DATA CLASS= XYDATA
##ORIGIN= Department of Geology, UAIC, Romania
##OWNER= http://rdrs.uaic.ro � stud. Apopei Andrei Ionut
##LONGDATE= 2010/09/11 15:46:30.0682 +0300 $$ export date from JSpecView
##SPECTROGRAPHDATASYSTEM= HE 532 (Horiba Jobin-Yvon)
##XUNITS= Raman shift (1/cm)
##YUNITS= Intensity (cnt)
##XFACTOR= 3.188909E-3
##YFACTOR= 3.27785022E-4
##FIRSTX= 3399.61
##FIRSTY= 0
##LASTX= 210.701
##NPOINTS= 1024
##XYDATA= (X++(Y..Y))
1066073@J1268o412K646j18J114m744l102K838M397p508M917o907M260o39R680A2008
1052896C048N820j625r96j023n430P161p018Q036l733P83j462n31L081j0139L520E75
1039622G597q086M777Q09m77k804p567O310J903K204N598r456M334P570n458k968F629
1026251C059M970o170P953o771K62k283N544K178n047P1k256j818l296O995k03D464
1012782A0227l40k118r619J768L218K042L519l651Q91k994J193l925O338n294N053G501
999213E92M614q59M258J987L45l844p100j735J1429m691L520r42O18l487n04l296a815
984735F740M670q606N135k502k830Q857o964L575n978L438J521L192j0248M784I841
971774E483k196N331P87m769M701m195o36J170J853M153m113j72j130l018L002D245
$$ plain form
1066073 0 11268 4856 7502 7384 8498 3754 652 3490 7887 379 5296 -1611 2649 2010 11690 12008
1052896 3048 8868 7243 6247 5224 -206 6955 -63 7973 4240 5023 3561 3030 6111 -4028 -508 575
1039622 7597 -489 4288 5097 4620 1816 -5751 559 2462 4666 10264 808 5142 12712 7254 4286 6629
1026251 3059 8029 1859 9812 3041 3303 1020 6564 8742 3695 3766 1510 -308 -3604 3391 3188 4464
1012782 10227 9887 7769 -1850 -82 3136 5178 8697 5046 5937 2943 4136 211 6549 1255 6308 7501
999213 592 5206 4347 8605 10592 10937 7093 -7 -1742 9687 4996 8516 7574 8192 4705 4201 905 -1815
984735 6740 11410 2804 7939 5437 2607 11464 4500 8075 2097 5535 7056 10248 0 4784 9841
971774 5483 3287 8618 9405 4636 9337 5142 4506 5676 7529 11682 7569 7397 6267 3249 6251 4245
957901E687j103N986l923J9o852P85P572k938J086n046J934O395K508n429J659A268
943925F321p318M752M82J768K781m938K08J631p101j2P187M723p949Q746j3040c140
929848A32J985p402P404l41M311k230o254K395P322r320L599l846L079K504J245A968
915664d041K722m257P813k177k07R838q692J599k096p00o558M637J818O388j974E881
901374C844k201j0084M970n130J0252j161L792L848r071p813Q254J877k448M558C776
887830h34O45O857p320l68M751k312J876L16k503J465k612j546J712K724J493E563
873333F179n678L244l516K505J383N461K88o090P26k586j218k914l97k121N570B191
858729e239o71O747k258q35K641m51M474j1126R812o719j520l15M228k641Q571G48
$$ plain form
957901 5687 4584 10570 6647 6666 -186 599 8171 5233 6319 1273 3207 9602 12110 6681 8340 1268
943925 6321 -997 3755 4237 6005 8786 3848 4056 5687 -1414 -1426 5761 10484 2535 11281 -1759 -3140
929848 132 2117 -5285 2119 1778 6089 3859 -2395 0 7322 -1998 1601 -2245 834 3338 4583 1968
915664 -4041 -1319 -5576 2237 60 -147 9691 999 2598 502 -198 -6756 -2119 -301 6087 4113 5881
901374 3844 1643 -8441 -3471 -8601 1651 490 4282 8130 -941 -8754 -500 1377 -1071 3487 3776
887830 -834 -189 6668 -652 -1020 3731 1419 3295 3611 1108 2573 -39 -1585 127 2851 4344 5563
873333 6179 501 3745 229 2734 4117 9578 9866 3776 4502 1916 698 -2216 -2613 -4734 836 2191
858729 -5239 -5910 837 -1421 -2256 385 -66 4408 -6718 3094 -3625 -5145 -5460 -1232 -3873 4698 748
844013g827L48J0721j0217O150k224J115k061k826N302R51N41k81J2583p615l921C552
829190H36P60k470o08M319l920Q97K677K403K649q134R711r63j784k194r91J446A1691
813372H566j537M239o409M703q078M430M020J858L144j1718K734m629Q755K351@
799204A1397k179m177L596J20m506o47K255K802n218M307j112m397M827O934n656H109
784042A3456r488n794O934o20j524M935J022r49m781J979m590m754M415p4R94E411
768764E714j666n552O33J180N586k16k460n855j722M518l420P145N120j6230J561f184
753374d158K19j560J1605q158P089l915J230j452m053K380L446j125N362q186C346
738779B199K505p458J410J575l96P322l297J6082R129j436o088j4437k995J575C981
$$ plain form
844013 -7827 -7479 3242 -6975 -825 -3049 -1934 -3995 -6821 -1519 -568 -27 -308 12275 4660 739 3552
829190 836 1596 -874 -1482 2837 -1083 -186 2491 4894 7543 -591 9120 8157 6373 4179 3188 4634 11691
813372 8566 7029 11268 4859 9562 1484 5914 9934 11792 14936 3218 5952 1323 10078 12429 0
799204 11397 9218 5041 8637 8757 4251 3604 5859 8661 3443 7750 6638 2241 7068 14002 8346 8109
784042 13456 3968 -1826 5108 4488 2964 7899 8921 7972 3191 5170 580 -4174 241 167 1161 5411
768764 5714 4048 -1504 -871 309 5895 5679 3219 -2636 -4358 160 -3260 3885 9005 -7225 -5664 -6184
753374 -4158 -3939 -5499 6106 -2052 5037 1122 2352 900 -3153 -773 2673 1548 6910 -1276 3346
738779 2199 4704 -2754 -1344 231 -165 7157 3860 19942 29071 27635 21547 7110 4115 5690 3981
724085a669J083L136n212L301J959L683P21p572K966p57J434r76O12k590o532g827
708352D116n546N265j28l028J816m616j140O414M47q229O578k071q66l549P043a919
692500a362m425L677l823n110L622n11R288l741m29M388q613M47l687Q986l768i541
676529g644O659k838j661K417J103N784p327l47R587m398m84k93r50L055L080C978
660436h25j189N899J959j627m610J193q59J960J878L410K016p126O094m717l184C930
644220A404Q093n920M919q848P656n782K785j074M620n864q8L991m138M429L334I622
627876B694L034K42n970L134M257l900N570o473J054L654o692Q636p25n433N542E709
611410B411J108J50N06M749p650l025N323J3j903P102m886N980n926m695M583C771
$$ plain form
724085 -1669 -586 2550 -2662 639 2598 6281 7002 -570 2396 1639 3073 2097 2709 119 -6413 -7827
708352 4116 -1430 3835 3707 679 2495 -2121 -3261 3153 3600 -4629 1949 -122 -988 -4537 2506 -1919
692500 -1362 -5787 -2110 -5933 -11043 -7421 -7932 1356 -2385 -2814 1574 -7039 -6592 -10279 -1293 -5061 -9541
676529 -7644 -985 -3823 -5484 -3067 -1964 3820 -3507 -3854 5733 1335 851 558 -392 2663 5743 3978
660436 -825 -2014 3885 5844 4217 -393 800 -59 1901 3779 7189 9205 2079 8173 3456 272 3930
644220 1404 9497 3577 8496 -352 7304 1522 4307 3233 7853 1989 1901 5892 1754 6183 9517 9622
627876 2694 5728 5970 0 3134 7391 3491 9061 2588 3642 7296 604 9240 8515 3082 8624 5709
611410 2411 3519 3669 4175 8924 1274 -1751 3572 3585 1682 8784 3898 9878 3952 -743 3840 3771
594818E454j110M0m996J902N650j629l956N732l573M056j264j318L445k384Q45C22
578097A3266r555J559n257J0016m817j014l640M790n912L724J369M216j749N22I710
562239D225n288N70N715j730l88L197l536l61l727j073N442L78j236l262k660C816
545268C209p394O838o902K897Q98L527k550k741J063o34K43m15L144o765L144b52
528162E875L527q243L719j646k165j240j439M009l764R647j0278J2988j026j3999e088
511943D809m336L163P56r41j543o4K782l348K810m524j158P848K839m276j238D339
494580A816l564R000p833j40k276R466L994J640m163k876j288M186n256L941P67H837
477079E143l55m788N602L878n729J661k143N383m060K427O095o93m087l540J606F090
$$ plain form
594818 5454 4344 4384 -612 1290 6940 5311 1355 7087 3514 7570 6306 4988 8433 6049 6894 322
578097 13266 3711 5270 13 10029 5212 4198 558 5348 -564 3160 4529 8745 6996 7518 9710
562239 4225 -1063 -493 5222 3492 3104 6301 2765 2404 -1323 -2396 3046 3424 2188 -1074 -3734 3816
545268 3209 -4185 2653 -4249 -1352 -454 3073 523 -2218 -1155 -1789 -1546 -1961 1183 -5582 -2438 -252
528162 5875 9402 1159 4878 3232 1067 -173 -1612 2397 -1367 8280 -1998 10990 9964 -4035 -5088
511943 4809 473 3636 4392 3451 1908 1844 4626 1278 4088 -436 -1594 6254 9093 4817 3579 4339
494580 1816 -1748 7252 -581 -721 -2997 6469 10463 12103 7940 5064 3776 7962 2706 6647 7414 8837
477079 5143 4788 0 5602 9480 3751 5412 3269 8652 4592 7019 13114 12421 8334 4794 6400 6090
459442A5523j1176M124m471k28j74l7L87j977Q917k113m029m083j154R54l05K705b203
440621b343K296K379L966n202L474k300N035j1606M707K737l476J999K573l474G390
423756a093m542L223N669j994o53L2l663k3N232k14m457M740k376o79K577M166E31
404637A905J621l169M522n14k458K032J375M17k265q314O521j252J266L866l167G539
386433C961r50J677M73k647l851l249R479o068j28K253l47L403Q85m726k509K883C916
367003D089L979q311M773l46N58N156r898N916m075L917j010M874L040j177j36A1294
348502A1074m436O704J531m520J639O400j948l071L662J31M30O616j650J7097D1484
330956E1464K4185Q775K4486J8845L6198L4611M5748M5284O1815R2303J19128F84075
$$ plain form
459442 15523 4347 8471 4000 3772 3598 3561 3948 1971 10888 8775 4746 663 -491 463 158 2863 -2203
440621 -2343 -47 2332 6298 1096 4570 2270 7305 -4301 406 3143 -333 1666 4239 765 7390
423756 -1093 -5635 -2412 3257 1263 610 642 -3021 -3044 2188 1974 -2483 2257 -119 -798 1779 5945 531
404637 1905 3526 357 4879 4365 1907 3939 5314 5731 3466 -4848 1673 421 1687 5553 2386 7539
386433 3961 3011 4688 5161 2514 -1337 -4586 4893 -1175 -1303 950 603 4006 4891 165 -2344 539 3916
367003 4089 8068 -243 4530 4184 4742 9898 0 5916 1841 5758 4748 9622 12662 11485 11349 11294
348502 11074 6638 13342 14873 10353 11992 18392 16444 13373 17035 17166 17596 24212 22562 39659 41484
330956 51464 75649 84424 108910 127755 163953 198564 244312 289596 351411 443714 562842 684075
316604H30599J07686N0672q7112j89123k23991j81512j23516p3457m3814k1727C4795
303276C4137J0480J0672K1921J7705K4083Q453N525K596j5086k3132j2103k4147E3845
287634C6815Q69r422n563N658L961J0803j5938O040J798n997J1271J665N413n342C9589
269633C3069j1747m111K266K731o493J855O262j922p73J828o794L223o36J745A9347
251495B4760l073r394o083L523m468j020J838j170l606K935R970J1010O192J0846E3708
233221E8395j854m099m591r025N235k429J020L127R587J3555J2844K3710K9184B02189
215965C09460J47396J74630J21695K3956j01509q5388n7634k5803k4571r7157B73001
202072A79676p7396l5710k3066r709j0119r709n084p656J376N591m919O851R094B7329
$$ plain form
316604 830599 938285 988957 901845 712722 488731 307219 183703 110246 66432 44705 34795
303276 34137 44617 55289 77210 94915 118998 127451 132976 135572 120486 97354 85251 61104 53845
287634 36815 37684 28262 22699 28357 32318 43121 27183 33223 35021 29024 40295 41960 47373 42031 39589
269633 33069 21322 17211 19477 22208 15715 17570 23832 21910 21137 22965 16171 19394 18758 20503 19347
251495 24760 21687 12293 6210 9733 5265 4245 6083 4913 1307 4242 14212 25222 31414 42260 53708
233221 58395 56541 52442 47851 38826 44061 41632 42652 45779 55366 68921 81765 105475 134659 202189
215965 309460 456856 631486 753181 777137 675628 590240 532606 506803 482232 385075 273001
202072 179676 102280 66570 43504 33795 23676 13967 8883 1227 2603 8194 3275 10126 19220 27329
184594C3742Q246O494j0338J1558K718L675j56P698J3283K3628K8500K3793J5527A66213
166992A65565j3979j962j6716p03k2080k1943l6148l1714j1241r079k955k299d735
150451g473K72j589O594N088J8307L281O345j812p176R902J5704K4572Q367Q286H5374
131411I5300J9096K5992O2037Q1415J03339R4415L7649l8523o7564q9652o3404B13035
115835A98815p516m397J7719M6895P8534J23668J40581J10474J7359o3191j17221C83580
100162B73474q1504m1954m0259k9913J782l447J424K8o130j3850l3037j0895p227A4155
81957C724o298L937L909P358L1251J7483L8805K6980M207j8702l4057C8025
$$ plain form
184594 33742 41988 48482 38144 49702 52420 56095 55939 63637 76920 100548 129048 152841 168368 166213
166992 165565 151586 149624 132908 132205 110125 88182 52034 20320 9079 0 -2955 -5254 -4735
150451 -7473 -7201 -8790 -2196 2892 21199 24480 30825 29013 21837 31739 47443 72015 80382 88668 85374
131411 95300 114396 140388 202425 283840 387179 481594 519243 480720 413156 323504 260100 213035
115835 198815 191299 186902 204621 251516 330050 453718 594299 704773 722132 658941 541720 383580
100162 273474 191970 150016 109757 79844 81626 78179 79603 79631 73501 59651 26614 15719 8492 14155
81957 3724 -2574 1363 5272 12630 43881 61364 100169 127149 131356 112654 78597 38025
66073G470  $$checkpoint
##END=