##TITLE= Raman spectrum of Linarite � http://rdrs.uaic.ro
##MINERAL= Linarite
##CHEMISTRY= PbCu(SO4)�(OH)2
##JCAMP-DX= 5.01
##DATA TYPE= RAMAN SPECTRUM
##DATA CLASS= XYDATA
##ORIGIN= Department of Geology, UAIC, Romania
##OWNER= http://rdrs.uaic.ro � stud. Apopei Andrei Ionut
##LONGDATE= 2009/11/24 21:09:48.0734 +0200 $$ export date from JSpecView
##XUNITS= Raman shift (1/cm)
##YUNITS= Intensity (cnt)
##XFACTOR= 3.188736E-3
##YFACTOR= 4.75468941E-4
##FIRSTX= 3399.97
##FIRSTY= 16.87770293
##LASTX= 211.234
##NPOINTS= 1024
##XYDATA= (X++(Y..Y))
1066244C5497L888m676k340l176K260j197J616o013N372l305l092Q5L491l182k808B1990
$$ 35497 39385 34709 32369 29193 31453 30256 31872 25859 31231 27926 24834 24919 28410 25228 22420 21990
1053066B2070J114j568j835J023o80k200k55n21M22O56J643m300O31l19n238O671A4529
$$ 22070 23184 21616 19781 20804 20124 17924 17669 17148 17570 18226 19869 15569 16200 15881 10643 17314 14529
1039007A2161J834o026J185m007M68L620J826m987J518k124L603L50l522k763L717B413
$$ 12161 13995 7969 9154 5147 5615 9235 11061 6074 7592 5468 9071 9421 5899 3136 6853 2413
1025629F324j20N23q85N57j513Q17L66J944l044m978L508Q46L94L3o23J10K008E816
$$ 6324 6204 6727 5842 6399 4886 5703 6069 8013 4969 -9 3499 4345 4739 4772 4149 4259 6267 5816
1010563C864j674J500l650K351L472l09n185J978q68J074N1M067m707j66K321J505E262
$$ 3864 2190 3690 40 2391 5863 5554 369 2347 1479 2553 2604 6671 1964 1798 4119 5624 5262
996172G480j063n756J383K891k828j002j9M772m824M869n981L096k6k417j79K330i4
$$ 7480 6417 661 2044 4935 2107 1105 1086 5858 1034 5903 -78 3018 2992 575 396 2726 -94
981671A102N13J018k492K436L418M6J210j067k775L96Q54k656j377O605m611j599F09
$$ 1102 1615 2633 141 2577 5995 6041 7251 6184 3409 3805 4659 2003 626 7231 2620 1021 609
967057D530j207k02L447J078O01k568J48N7L388j080k423K662j532J456o41k098E616
$$ 4530 3323 3121 6568 7646 8247 5679 5827 5884 9272 8192 5769 8431 6899 8355 7714 5616 5616
952327H992j35l61J350n42k570K948n258J993K60L089N81m21n56J199j422J930E872
$$ 8992 8857 8496 9846 9304 6734 9682 4424 6417 6677 9766 10347 9926 9370 10569 9147 11077 5872
937481A1611O2j419K686j304n73m9J79j84j849R0J13K370M468n836N01K737m217A1279
$$ 11611 11673 10254 12940 11636 11063 11014 11193 11009 9160 9250 9363 11733 16201 10365 10866 13603 9386 11279
921685I365J689j686K99N291j731k802M8P55M221m53k802k232K762J17O18p27A4171
$$ 9365 11054 9368 9667 14958 13227 10425 10473 11228 15449 14996 12194 9962 12724 12841 13459 12732 14171
906597A5930l418k391N657l897L422k916N999k734l213K06L650O62K52r0J460A4544
$$ 15930 12512 10121 15778 11881 15303 12387 18386 15652 12439 12645 16295 16957 17209 17119 18579 14544
892241A2811L215K029n154L192p99k350O37j735L532n50M99J798K641l583q25A3826
$$ 12811 16026 18055 12901 16093 15294 12944 13581 11846 15378 14828 15327 17125 19766 16183 15358 13826
877774A6215k832N056l814q49j740N18J816n320O307j376K020n56q31j310M071A3625
$$ 16215 13383 18439 14625 13776 12036 12554 14370 9050 15357 13981 16001 15445 14614 13304 17375 13625
863204A4594J105J174m094L475j677r49j97K539m301L723m439J43M62J169NK376H728
$$ 14594 15699 16873 12779 16254 14577 13628 13431 15970 11669 15392 10953 11096 11558 12727 12732 15108 8728
847652A1263q18k801K465j069j139l167N176k667m79K554N92J503m037K164K187A3115
$$ 11263 10445 7644 10109 9040 7901 4734 9910 7243 6764 9318 9910 11413 7376 9540 11727 13115
832854A2359p56K299k330r17J409j191n53K068j169K90j285j102J657j536k585I476
$$ 12359 11603 13902 11572 10655 12064 10873 10320 12388 11219 11509 10224 9122 10779 9243 6658 9476
817945A0105q08l703K429j219J243n36M138j493J925m640K267j107P16L156l639H044
$$ 10105 9297 5594 8023 6804 8047 7511 11649 10156 12081 7441 9708 8601 9317 12473 8834 8044
802923A1222l366o0K81J171k774R64J717l755p00m72L71o33j179K582j431L25D
$$ 11222 7856 7796 8077 9248 6474 7438 9155 5400 4700 4228 4599 3966 2787 5369 3938 4263 4
786895I540l529k070N865j295l393j32J327j888l61K467k230J64L629l165j661D435
$$ 9540 6011 3941 9806 8511 5118 4986 6313 4425 4064 6531 4301 4465 8094 4929 3268 4435
771638H37L470K078L47R84m442N636l097L082k845l119L971m327L128j272K057G564
$$ 837 4307 6385 6732 7716 3274 8910 5813 8895 6050 2931 6902 2575 5703 4431 6488 7564
756265F976j454j7k69k023M497n831K970L814O22j909K652l709j840m94PL497A911
$$ 6976 5522 5505 5236 3213 7710 1879 4849 8663 9285 7376 10028 6319 4479 3985 3992 7489 1911
739864G368l33J058k157N003J263m892K428j791M183K109p444L546j515K042r22H591
$$ 7368 7035 8093 5936 10939 12202 7310 9738 7947 12130 14239 6795 10341 8826 10868 9946 8591
724249F758j217J725J862j992r8r64k309K023M965l470O11K344l195J33k99K802E710
$$ 6758 5541 7266 9128 7136 7038 6074 3765 5788 10753 7283 7894 10238 7043 7176 6877 9679 5710
707591G191O15j505J072L900m582j184J166k277m2j205M929l141k297M042l35I523
$$ 7191 7806 6301 7373 11273 6691 5507 6673 4396 4354 3149 8078 4937 2640 6682 6347 9523
691732D972K562k659J743k064L066k428L934k655L6p84J224L11J430J203l266D454
$$ 4972 7534 4875 6618 4554 7620 5192 9126 6471 6507 5723 6947 7258 8688 9891 6625 4454
675754I078n247N492n26j256K781l009R81K828l326p96k094M678k001k844j99D729
$$ 9078 3831 9323 8797 7541 10322 7313 8294 11122 7796 7000 4906 9584 7583 4739 4540 4729
659653F128J855L74k247j266J516j310Q34N9o01J680J771o184J909p56L119j234B863
$$ 6128 7983 8357 6110 4844 6360 5050 5884 5943 5342 7022 8793 2609 4518 3762 6881 5647 2863
642471G513q22M11P99m09k050K352j980j546K172L426l573m985K083K061O49K39C410
$$ 7513 6691 7102 7901 7492 5442 7794 5814 4268 6440 9866 6293 1308 3391 5452 6101 6340 3410
625147A484R71L206l793L892k150M51J226k353P72j074L167m150K051L672k211F121
$$ 1484 2455 5661 1868 5760 3610 4061 5287 2934 3706 2632 5799 1649 3700 7372 5161 6121
608658D596L23l872j135L426R41J581j132K471j905K290k725J517M46K41J473G274
$$ 4596 4919 1047 -88 3338 4279 5860 4728 7199 5294 7584 4859 6376 6822 7063 8536 7274
592043E717k925J362J180J387m37K437j530k669P97L42j299K441J005m192k02G454
$$ 5717 2792 4154 5334 6721 6284 8721 7191 4522 5319 5661 4362 6803 7808 3616 3414 7454
575300F889m692L791J375k158k66k157L29J856j722r23J152J3k404q30J155K272D973
$$ 6889 2197 5988 7363 5205 4939 2782 3111 4967 3245 2322 3474 3487 1083 253 1408 3680 4973
557431F790m087j624L530l379O039p094O723l011L41L009m834K166j230j252K259E534
$$ 6790 2703 1079 4609 1230 7269 175 6898 3887 4228 7237 2403 4569 3339 2087 4346 5534
540418C941N96K512l962J282J761r74p69k455N297m119K59J924L133R90j768N6I311
$$ 3941 4537 7049 3087 4369 6130 5156 4387 1932 7229 3110 3369 5293 8426 9416 7648 7704 9311
522260G361l3M868n34j196N9N15P67j468R27l108O901j147J704l94j66k833l47A1803
$$ 7361 7328 12196 11662 10466 10525 11040 11807 10339 11266 8158 15059 13912 15616 15222 15056 12223 11876 11803
502936A1524K823k307J250K756q24j691j028l970j39k07J548l034m80J025L191I251
$$ 11524 14347 12040 13290 16046 15222 13531 12503 8533 8394 8187 9735 6701 6221 7246 10437 9251
485500H680j095l238k006L169m149J779L808m650K623j732P0l442N086J61R82E455
$$ 8680 7585 4347 2341 5510 1361 3140 6948 2298 4921 3189 3259 -183 4903 5064 6046 5455
467928D704K168k71O18k552L422j844l463N49K876j685o36K602J599m033L172G981
$$ 4704 6872 6601 7219 4667 8089 6245 2782 3331 6207 4522 3886 6488 8087 4054 7226 7981
450219D632L856j297L45Q46k300k391J439j479M973o382M59L171J371J963j571F452
$$ 4632 8488 7191 7536 8382 6082 3691 5130 3651 8624 2242 2701 5872 7243 9206 7635 6452
432372E474n378L490K077k665J985Q00m77n037M129o37k04L057P99j344l373j549F415
$$ 5474 96 3586 5663 2998 4983 5783 5306 269 4398 3761 3557 6614 7413 6069 2696 1147 6415
413324B357k04K508k142j778K736p52J37q21J482N47q44N24K804l967N00j60R34G189
$$ 2357 2153 4661 2519 741 3477 2725 2862 2041 3523 4070 3226 3750 6554 2587 3087 2927 3861 7189
393043A0380m516N46R0k487K141o180J434L145k30L144k009o40k420k373L964D670
$$ 10380 5864 6410 6500 4013 6154 -26 1408 4553 4323 7467 5458 4818 2398 25 3989 4670
374747G996n383K482L143J388J456l036L508K505J843J0941R778J9171L5906M9130A78832
$$ 7996 2613 5095 8238 9626 11082 8046 11554 14059 15902 26843 36621 55792 91698 140828 178832
357396A63347l6233m2867l1992q690j3433n818j827M52o228n05K139R31j211j326A4957
$$ 163347 127114 84247 52255 43565 30132 24314 22487 22939 16711 16206 18345 19276 18065 16739 14957
339912A9993n385M215j827m380J616M625L942N994J069O427j666L281O724J845E0530
$$ 19993 14608 18823 16996 12616 14232 18857 22799 28793 29862 36289 34623 37904 44628 46473 50530
322300D8636Q914K804l831o339j140N70k121L284M57J985P434K0453O3112J60855F35400
$$ 48636 57550 60354 56523 50184 49044 49614 47493 50777 51234 53219 60653 81106 144218 305073 635400
304559I52211M7606l00751l55581j97010p0606l0182j5727q224j0596n625K288H312
$$ 952211 999817 699066 343485 146475 75869 45687 29960 21736 11140 5515 7803 8312
290044H799k796j473m186M137j71J1l30p9J403J906l383M688M074k265L574n318A2826
$$ 8799 6003 4530 344 4481 4310 4321 3991 3912 5315 7221 3838 8526 12600 10335 13909 8591 12826
269802H239K413j189j097J367j370l42p29P137K419N110L309J532m692j043n123A4124
$$ 8239 10652 9463 8366 9733 8363 8021 7292 14429 16848 21958 25267 26799 22107 21064 15941 14124
250527A0940K37k179P9J220j561k221Q58J315l176J544j441k968M648m904L418C643
$$ 10940 11177 8998 9077 10297 8736 6515 7373 8688 5512 7056 5615 2647 7295 2391 5809 3643
231097A249j252J439K329K284l82l641N3j086M592O94j653J586q76o70j672M075H272
$$ 1249 -3 1436 3765 6049 5667 2026 2079 993 5585 6279 4626 6212 5336 4666 2994 7069 8272
210355G584K117j325O360M149N130J2610L8900O8699O2363K7205l9779o6294n5578E8629
$$ 7584 9701 8376 14736 18885 24015 36625 75525 144224 206587 233792 194013 127719 72141 58629
192935F2174k16j2278r585p830n662l107n638m110m60m176K186p31l034J322K440A4260
$$ 62174 61958 49680 40095 32265 26603 23496 17858 13748 13288 9112 11298 10567 7533 8855 11295 14260
173043A2552K351M335K945O730J2477K9486N3631O0700N0167j588l9436n4392I0604
$$ 12552 14903 19238 22183 28913 41390 70876 124507 185207 235374 233786 194350 139958 90604
156541F2091j8504r361k225n416O235J5491L3572L3093J9527n416l3323l1932D2067
$$ 62091 43587 34226 32001 26585 32820 48311 81883 114976 134503 129087 95764 63832 42067
139929C7608N436L51n304q040q269n374k524j363J852n44J463L467l100j619J504B3567
$$ 37608 43044 43395 38091 30051 21782 16408 13884 12521 14373 13829 15292 18759 15659 14040 15544 23567
119608C0813J2284J3217Q609L479m709q883r227k23m76m263j1128p460k971l840A3341
$$ 30813 43097 56314 64923 68402 63693 54810 45583 45360 44884 40621 29493 22033 19062 15222 13341
100332G238j523m216J252j600M93R00o09K831m766M077k015RN07K74J431J359G679
$$ 7238 5715 1499 2751 1151 1644 2544 1935 4766 0 4077 2062 2071 2578 2852 4283 5642 7679
78471I073M079N897K175O706L39k882p745j390I656
$$ 9073 13152 19049 21224 27930 28269 25387 17642 16252 9656
66244A0304  $$checkpoint
##END=