##TITLE= Raman spectrum of Magnetite � http://rdrs.uaic.ro
##MINERAL= Magnetite
##CHEMISTRY= Fe++Fe+++2O4
##JCAMP-DX= 5.01
##DATA TYPE= RAMAN SPECTRUM
##DATA CLASS= XYDATA
##ORIGIN= Department of Geology, UAIC, Romania
##OWNER= http://rdrs.uaic.ro � stud. Apopei Andrei Ionut
##LONGDATE= 2010/01/10 10:23:45.0519 +0200 $$ export date from JSpecView
##XUNITS= Raman shift (1/cm)
##YUNITS= Intensity (cnt)
##XFACTOR= 3.188909E-3
##YFACTOR= 1.21804978E-4
##FIRSTX= 3399.61
##FIRSTY= -0.3904425
##LASTX= 210.701
##NPOINTS= 1024
##XYDATA= (X++(Y..Y))
$$ plain form
1066073 -3205 -3540 -3484 -2944 -1878 -300 1716 4053 6564 9096 11509 13685 15539 17016 18085 18728 18934 18691
1052118 17991 16831 15231 13238 10941 8467 5979 3657 1675 181 -736 -1055 -831 -189 698 1638 2448 2991
1038054 3192 3053 2641 2075 1497 1041 802 819 1067 1463 1884 2201 2303 2128 1679 1029 308 -317 -674 -621 -77 963
1020716 2415 4119 5859 7395 8503 9004 8797 7871 6310 4280 2005 -263 -2283 -3850 -4825 -5149 -4845 -4009
1006410 -2792 -1378 46 1310 2287 2901 3128 2995 2565 1922 1153 334 -481 -1261 -1996 -2691 -3348 -3962 -4507 -4935
990379 -5177 -5157 -4802 -4062 -2923 -1420 362 2294 4217 5964 7381 8353 8822 8791 8328 7550 6608 5661 4853
975023 4294 4047 4121 4481 5053 5742 6451 7086 7573 7857 7906 7702 7241 6529 5580 4415 3068 1588 34 -1522
958720 -3007 -4353 -5509 -6452 -7186 -7745 -8181 -8548 -8889 -9213 -9486 -9631 -9534 -9068 -8116 -6603 -4527 -1969 898 3826
$$ packed form
1066073c205l35N6N40J066J578K016K337K511K532K413K176J854J477J069O43K06A8691
1052118A7991j160j600j993k297k474k488k322j982j494r17l19K24O42Q87R40Q10B991
1038054C192j39m12n66n78m56k39J7K48L96M21L17J02j75m49o50p21o25l57N3N44I63
1020716B415J704J740J536J108N01k07r26j561k030k275k268k020j567r75l24L04d009
1006410b792J414J424J264R77O14K27j33m30o43p69q19q15p80p35o95o57o14n45d935
990379e177K0L55P40J139J503J782J932J923J747J417R72M69l1m63p78r42r47D853
975023D294k47P4L60N72O89P09O35M87K84M9k04m61p12r49j165j347j480j554a522
958720c007j346j156r43p34n59m36l67l41l24k73j45R7M66R52J513K076K558K867C826
$$ plain form
942275 6520 8682 10054 10458 9834 8245 5876 3006 -33 -2904 -5311 -7041 -7983 -8139 -7607 -6555 -5188 -3710
927352 -2295 -1065 -85 634 1122 1430 1615 1726 1795 1841 1877 1912 1968 2074 2270 2599 3093 3767 4608 5571 6581 7549
908954 8380 8988 9318 9345 9084 8579 7901 7129 6339 5597 4949 4424 4039 3800 3711 3778 4005 4394 4937 5613 6383 7191
890377 7975 8671 9231 9629 9870 9990 10048 10109 10231 10449 10762 11133 11494 11769 11888 11810 11544 11147 10719 10384 10259 10422
871621 10888 11596 12408 13130 13553 13491 12827 11543 9735 7602 5415 3469 2022 1250 1201 1790 2810 3970 4956
855277 5492 5398 4626 3270 1549 -241 -1786 -2818 -3172 -2815 -1854 -509 935 2187 3011 3276 2978 2238 1272
838795 343 -299 -466 -74 847 2157 3648 5081 6246 6998 7287 7160 6750 6234 5800 5597 5711 6143 6812 7578
821297 8266 8703 8746 8309 7366 5956 4164 2112 -64 -2224 -4235 -5973 -7330 -8210 -8541 -8280 -7430 -6045 -4245
$$ packed form
942275F520K162J372M04o24j589k369k870l039k871k407j730r42j56N32J052J367c710
927352b295J230R80P19M88L08J85J11O9M6L6L5N6J06J96L29M94O74Q41R63J010G549
908954H380O08L30K7k61n05o78p72p90p42o48n25l85k39q9O7K27L89N43O76P70G191
890377G975O96N60L98K41J20N8O1J22K18L13L71L61K75J19p8k66l97m28l35j25A0422
871621A0888P08Q12P22M23o2o64j284j808k133k187j946j447p72m9N89J020J160D956
855277E492r4p72j356j721j790j545j032l54L57R61J345J444J252Q24K65k98p40A272
838795C43o42j67L92R21J310J491J433J165P52K89j27m10n16m34k03J14M32O69G578
821297H266M37M3m37r43j410j792k052k176k160k011j738j357q80l31K61Q50J385d245
$$ plain form
804529 -2206 -149 1685 3077 3868 3988 3486 2522 1353 287 -373 -387 371 1879 3971 6357 8678 10575
788514 11758 12067 11502 10228 8537 6794 5357 4508 4390 4979 6092 7426 8620 9339 9344 8546 7026 5026 2900
771471 1042 -187 -533 101 1641 3852 6387 8848 10859 12126 12481 11902 10501 8497 6168 3809 1684
756099 1 -1103 -1562 -1372 -580 731 2444 4418 6483 8447 10108 11272 11788 11579 10677 9244 7570 6052 5144
738779 5281 6808 9899 14507 20344 26902 33513 39442 43999 46643 47075 45276 41515 36302 30299 24214 18691
723163 14215 11049 9222 8549 8694 9253 9835 10140 10000 9394 8425 7284 6183 5312 4786 4635 4800 5159 5565
705564 5876 5992 5867 5505 4946 4243 3430 2513 1460 213 -1288 -3077 -5137 -7382 -9656 -11756 -13461 -14573
688753 -14963 -14595 -13544 -11985 -10164 -8355 -6809 -5710 -5145 -5091 -5430 -5976 -6518 -6863 -6875 -6494 -5741 -4704 -3513
$$ packed form
804529b206K057J834J392P91J20n02r64j169j066o60j4P58J508K092K386K321A0575
788514A1758L09n65j274j691j743j437q49j18N89J113J334J194P19Np98j520k000B900
771471A042j229l46O34J540K211K535K461K011J267L55n79j401k004k329k359A684
756099Aj104m59J90P92J311J713J974K065J964J661J164N16k09r02j433j674j518E144
738779E281J527L091M608N837O558O611N929M557K644M32j799l761n213o003o085A8691
723163A4215l166j827o73J45N59N82L05j40o06r69j141j101q71n26j51J65L59E565
705564E876J16j25l62n59p03q13r17j053j247j501j789k060k245k274k100j705a4573
688753a4963L68J051J559J821J809J546J099N65N4l39n46n42l45j2L81P53J037c513
$$ plain form
670863 -2302 -1187 -238 522 1111 1573 1951 2267 2512 2641 2590 2292 1701 818 -308 -1573 -2839 -3957 -4800 -5287
651866 -5400 -5191 -4765 -4259 -3808 -3517 -3438 -3563 -3831 -4148 -4417 -4568 -4583 -4498 -4401 -4408 -4630 -5137 -5932 -6936 -7999 -8918
630771 -9479 -9504 -8888 -7630 -5839 -3715 -1518 483 2061 3074 3490 3389 2944 2378 1916 1737 1934 2499 3324
612382 4230 5003 5446 5413 4847 3780 2329 668 -1008 -2523 -3746 -4609 -5110 -5296 -5241 -5019 -4685 -4258 -3727 -3060
592858 -2227 -1218 -63 1159 2333 3316 3971 4192 3928 3192 2066 682 -802 -2232 -3486 -4492 -5235 -5746
575131 -6085 -6311 -6459 -6521 -6441 -6122 -5450 -4327 -2699 -580 1930 4656 7367 9810 11754 13025 13538 13307 12440
556265 11119 9561 7981 6553 5384 4505 3874 3395 2955 2445 1798 1001 99 -813 -1614 -2181 -2420 -2289 -1807
537234 -1057 -171 687 1354 1691 1610 1086 163 -1047 -2388 -3672 -4712 -5345 -5453 -4981 -3947 -2435 -593 1393
$$ packed form
670863b302J115R49P60N89M62L78L16K45J29n1k98n91q83j126j265j266j118q43e287
651866e400K09M26N06M51K91P9j25k68l17k69j51j5Q5R7pk22n07p95j004j063h918
630771i479k5O16J258J791K124K197K001J578J013M16j01m45n66m62j79J97N65C324
612382D230P73M43l3n66j067j451j661j676j515j223q63n01j86N5K22L34M27N31c060
592858b227J009J155J222J174R83O55K21k64p36j126j384j484j430j254j006p43e746
575131f085k26j48o2Q0L19O72J123J628K119K510K726K711K443J944J271N13k31A2440
556265A1119j558j580j428j169q79o31m79m40n10o47p97r02r12q01n67k39J31a807
537234a057Q86Q58O67L37q1n24r23j210j341j284j040o33j08M72J034J512J842A393
$$ plain form
518039 3318 4988 6246 6993 7202 6924 6275 5420 4542 3815 3373 3288 3560 4122 4853 5613 6265 6715 6923 6919 6787
496628 6652 6641 6851 7324 8025 8848 9632 10195 10371 10053 9215 7931 6357 4705 3203 2041 1338 1109 1269 1647
476047 2030 2210 2036 1452 515 -615 -1708 -2513 -2819 -2503 -1567 -141 1532 3148 4402 5051 4963 4149 2760
456319 1056 -650 -2055 -2932 -3172 -2809 -2001 -999 -82 504 600 172 -684 -1768 -2819 -3580 -3850 -3536 -2673 -1412
435365 9 1320 2279 2720 2591 1961 1002 -49 -946 -1483 -1535 -1081 -201 950 2177 3294 4160 4706 4938 4925 4770
413157 4580 4430 4343 4288 4192 3964 3531 2860 1982 996 47 -696 -1076 -987 -398 642 2005 3515 4983 6237 7164
390729 7716 7920 7855 7630 7352 7094 6885 6703 6490 6174 5703 5060 4285 3469 2739 2229 2047 2243 2793 3595 4483
368085 5263 5742 5778 5298 4322 2951 1345 -307 -1827 -3085 -4013 -4612 -4939 -5083 -5131 -5144 -5136 -5074 -4890 -4507 -3866
$$ packed form
518039C318J670J258P47K09k78o49q55q78p27m42q5K72N62P31P60O52M50K08mF787
496628F652j1K10M73P01Q23P84N63J76l18q38j284j574j652j502j162p03k29J60A647
476047B030J80j74n84r37j130j093q05l06L16R36J426J673J616J254O49q8q14B760
456319A056j706j405q77k40L63Q08J002R17N86R6m28q56j084j051p61k70L14Q63a412
435365IJ311R59M41j29o30r59j051q97n37n2M54Q80J151J227J117Q66N46K32j3D770
413157D580j50q7n5r6k28m33o71q78r86r49p43l80Q9N89J040J363J510J468J254G164
390729G716K04o5k25k78k58k09j82k13l16m71o43p75q16p30n10j82J96N50Q02D483
368085E263M79L6m80r76j371j606j652j520j258r28n99l27j44m8j3QO2J84L83c866
$$ plain form
345222 -2954 -1818 -566 654 1681 2380 2676 2574 2167 1616 1118 867 1001 1580 2562 3811 5126 6283 7083
324343 7393 7177 6501 5516 4427 3446 2745 2426 2498 2886 3451 4028 4465 4657 4569 4235 3747 3228 2797 2545 2519
301048 2720 3116 3669 4361 5214 6298 7726 9631 12132 15301 19139 23566 28433 33546 38707 43758 48610
282023 53258 57771 62261 66835 71546 76353 81102 85541 89360 92258 94010 94537 93942 92513 90686 88972 87861
262847 87728 88762 90922 93957 97457 100948 104003 106336 107868 108746 109307 109992 111239 113372 116517 120562 125184
243517 129924 134308 137977 140797 142931 144832 147180 150756 156294 164337 175143 188664 204610 222588 242293
226334 263691 287179 313627 344312 380729 424273 475892 535719 602794 674924 748730 819890 883562
211343 934927 969771 985037 979230 952624 907249 846635 775383 698583 621238 547706 481300 424039
$$ packed form
345222b954J136J252J220J027O99K96j02m07n51m98k51J34N79R82J249J315J157G083
324343G393k16o76r85j089r81p01l19P2L88N65N77M37J92q8l34m88n19m31k52B519
301048B720L96N53O92Q53J084J428J905K501L169L838M427M867N113N161N051D8610
282023E3258M513M490M574M711M807M749M439L819K898J752N27n95j429j827j714H7861
262847H7728J034K160L035L500L491L055K333J532Q78N61O85J247K133L145M045A25184
243517A29924M384L669K820K134J901K348L576N538Q043J0806J3521J5946J7978B42293
226334B63691K3488K6448L0685L6417M3544N1619N9827O7075P2130P3806P1160H83562
211343I34927L4844J5266n807k6606m5375o0614p1252p6800p7345p3532o6406D24039
$$ plain form
196260 376626 338601 308633 284900 265477 248677 233290 218696 204863 192217 181463 173376 168590
181083 167455 169948 175655 183828 193472 203468 212697 220142 224974 226600 224686 219164 210201 198181 183659 167313
162277 149898 132186 114906 98694 84038 71251 60452 51581 44422 38660 33934 29899 26274 22876
145705 19627 16550 13733 11298 9355 7977 7170 6881 6999 7378 7864 8321 8643 8771 8685 8406 7980 7468 6938
123036 6460 6096 5907 5938 6222 6774 7584 8624 9860 11268 12869 14757 17132 20308 24712 30848 39229 50294
101371 64308 81265 100823 122271 144558 166365 186243 202767 214713 221206 221834 216697 206380 191867
84392 174402 155318 135872 117104 99747 84198 70545 58647 48231 39008 30752 23357 16847 11339
67299 6989 3921
$$ packed form
196260C76626l8025k9968k3733j9423j6800j5387j4594j3833j2646j0754q087A68590
181083A67455K493N707Q173R644R996R229P445M832J626j914n522q963j2020j4522A67313
162277A49898j7712j7280j6212j4656j2787j0799q871p159n762m726m035l625B2876
145705A9627l077k817k435j943j378q07k89J18L79M86M57L22J28q6k79m26n12F938
123036F460l64j89L1K84N52Q10J040J236J408J601J888K375L176M404O136Q381E0294
101371F4308J6957J9558K1448K2287K1807J9878J6524J1946O493O28n137j0317A91867
84392A74402j9084j9446j8768j7357j5549j3653j1898j0416r223q256p395o510A1339
67299F989C921
##END=