##TITLE= Raman spectrum of Malachite � http://rdrs.uaic.ro
##MINERAL= Malachite
##CHEMISTRY= Cu2(CO3)(OH)2
##JCAMP-DX= 5.01
##DATA TYPE= RAMAN SPECTRUM
##DATA CLASS= XYDATA
##ORIGIN= Department of Geology, UAIC, Romania
##OWNER= http://rdrs.uaic.ro � stud. Apopei Andrei Ionut
##LONGDATE= 2009/10/19 00:50:31.0963 +0300 $$ export date from JSpecView
##XUNITS= Raman shift (1/cm)
##YUNITS= Intensity (cnt)
##XFACTOR= 3.188736E-3
##YFACTOR= 7.06327308E-4
##FIRSTX= 3399.97
##FIRSTY= -4.07509998
##LASTX= 211.234
##NPOINTS= 1024
##XYDATA= (X++(Y..Y))
1066244e769L1383L0578K8378K6859K2236J2709O014p214j7070j3954k2527k2242D9132
1055399C4114j3199n739j1944l687O33m71r18K068r96K669L137L660K597K754P334C1305
1042140C6590O472N933J557r78K014l45j0943j921r630l205j026p163K753j3193F294
1029574D539k13k761K504l73o73J16M19j700M535k198j311J534j225J679k823P02F027
1015333D163L24k452N71K58k845L473J688n7J881o591O282m26k131J805N65r26D348
1000983H931n902K669j400K015J205l3n631K030N582O81k066j848o264O518N206G017
987325E604M797l648L182k317k93J304K65n370L926k348O598r16J41l476J011A2544
973568H476L464n774L348L843k893j660j030K03J105P10K622l086J83J745m058G243
$$ y = [-5769, 25614, 56192, 84570, 111429, 133665, 146374, 152388, 145174, 128104, 114150, 91623, 69381, 49132, 34114, 20915, 15176, 3232, -455, 178, -293, -1211, 857, -139, 2530, 5667, 9327, 11924, 14678, 22012, 31305, 36590, 43062, 48995, 50552, 49574, 51588, 51243, 40300, 38379, 28749, 25544, 24518, 17355, 20108, 6915, 6294, 4539, 4326, 1565, 4069, 3696, 3023, 3139, 3558, 1858, 6393, 4195, 2884, 4418, 3193, 4872, 2049, 2751, 6027, 4163, 4487, 2035, 2606, 2864, 19, 3492, 5180, 5123, 7004, 413, 6695, 6269, 4138, 5943, 6508, 5582, 4348, 8931, 3029, 5698, 4298, 6313, 7518, 7485, 1854, 3884, 9466, 10147, 8081, 6233, -31, 6487, 11693, 7017, 5604, 10401, 6753, 9935, 7618, 7325, 8629, 8894, 3524, 7450, 5102, 11700, 10784, 10925, 7449, 8460, 12544, 8476, 11940, 6166, 9514, 13357, 10464, 8804, 7774, 7977, 9082, 9792, 12414, 9328, 9511, 11256, 7198, 7243]
959706G087M277m047L023ql096O087r254N299k828J198j638N161l587K845r80I233
945742A0454j187k278M252J786m345l070M178J246m632N660n725M529k668K680A2839
932507A1617l145J602l170J81L902K600n43m48j324j499j444l345L787Q19M88G656
918342A0564J472p719J643K07J428J387m468L556k551r25M038o024J515L610n485B250
904073F884j279K442P7l239k988j863M282L351M300k330n354j090O606J237nj749A0149
888847E433l242N462j982L097m522o25J779L815l397J256j59n66N19J897J140A527
874356F119J529O96l70m694Q180o961J433o98M381q297J0856p94m575L70k267D929
859758C845L996n21J864o356J032L861r65n677P449m99k729j70l581N68O364k85I326
$$ y = [7087, 11364, 7317, 10340, 10332, 7236, 13323, 4069, 9368, 6540, 7738, 6100, 11261, 7674, 10519, 9539, 9233, 10454, 9267, 6989, 11241, 13027, 8682, 5612, 9790, 11036, 6404, 12064, 6339, 10868, 8200, 10880, 12839, 11617, 8472, 10074, 6904, 7085, 10987, 13587, 13044, 12596, 11272, 9773, 8329, 4984, 8771, 9590, 10078, 7656, 10564, 12036, 4317, 5960, 6167, 7595, 8982, 4514, 8070, 5519, 4594, 8632, 2608, 4123, 7733, 2248, 2250, 6884, 5605, 8047, 8124, 4885, 1897, 34, 4316, 7667, 11967, 9637, 4283, 3193, 9799, 11036, 11031, 9282, 10149, 5433, 2191, 7653, 5671, 8768, 4246, 3621, 5400, 9215, 5818, 7074, 6915, 6349, 6868, 8765, 9905, 1527, 6119, 7648, 8344, 7974, 3280, 11460, 4499, 5932, 5234, 9615, 1318, 12174, 11380, 6805, 7175, 4908, 4929, 3845, 7841, 7320, 9184, 2828, 3860, 7721, 6756, 1079, 8528, 8029, 5300, 5130, 1549, 2117, 8481, 8196, 9326]
844181A0593j0618M407K371N823p826K372m472O637l018M912l018J015l23k320A172
830232F160m938J2608p787M968k030n326P159k904K350j197M908l021j606Q0q799C399
815301H461O01R32n681M361l529K673k271M146l087M396m541L658j364L889k79H59
800261D028P860k396J480k321l291l118M637l663J358N330L837q688J974j80O352I062
785104E098p85j136K100N628l603k459K618M652n139L118n394L522o115M992k667E425
769835G834m04L918j706q16k465N18M549K511J366o565l077O769l062n62M786A1670
754449A3525K435J075M53m725N063j34p57j050J177k178l19J811m98K252L434B2998
738948B1308J275m505j444J250R292n018J261N234k989l35j927m934N746M232B9398
$$ y = [10593, -25, 4382, 6753, 12576, 4750, 7122, 2650, 9287, 6269, 11181, 8163, 9178, 8855, 6535, 1172, 6160, 1222, 13830, 6043, 11011, 8981, 3655, 10814, 7910, 10260, 9063, 13971, 10950, 9344, 9424, 625, 3399, 8461, 9062, 9994, 4313, 8674, 5145, 7818, 5547, 9693, 6606, 11002, 6461, 10119, 8755, 12644, 12365, 859, 4028, 11888, 9492, 10972, 8651, 5360, 2242, 6879, 3216, 4574, 9904, 13741, 5053, 7027, 6847, 13199, 9062, 5098, 4313, 3177, 5277, 10905, 7302, 4843, 7461, 12113, 6974, 10092, 4698, 8220, 2105, 7097, 4430, 5425, 7834, 7430, 11348, 9642, 8826, 6361, 6879, 11428, 13939, 15305, 8740, 5663, 12432, 9370, 8808, 13594, 11670, 13525, 15960, 17035, 17488, 12763, 17826, 17692, 16935, 15885, 17062, 14884, 14565, 16376, 15878, 18130, 21564, 22998, 21308, 22583, 18078, 16634, 17884, 27176, 22158, 23419, 28653, 25664, 25329, 23402, 18468, 24214, 28446, 29398]
724249B4532K112P285p819j618M35l736L203L627l30K828K46q751k258n36j740A9499
708519B6343R68q19L484l944L420p283L455J534l180j825M086K494k878O09L360B3856
692669B7910j36P849r407L386J019n692K508J01K330j202L178K401n10m931K317C2874
676698B5631P526p558O826L450j2158O006R44o86M353p823L070J711K56n02O224C4168
660603C7326m501k079m329j733J406L266m489L884K00O460j1725R9J649k210J667B7391
644387C2603L060j5300J1259j0397R028j3113P902J252m74j289o640L77K529k434A4513
629011A7409k83q969K081O754L75p418m491R991m956l269m782O212m781J4684A3157
613522A5240m36l829O873l575J116n69J332k546j497K458J141q16M419J823n970A0940
$$ y = [24532, 26644, 33929, 26110, 24492, 24927, 21191, 24394, 28021, 27691, 30519, 30765, 22014, 19756, 19220, 17480, 19499, 26343, 27311, 26492, 29976, 26032, 29452, 22169, 25624, 27158, 23978, 22153, 26239, 28733, 25855, 26464, 29824, 23856, 27910, 27774, 35623, 26216, 29602, 30621, 24929, 27437, 27538, 29868, 28666, 31844, 34245, 33735, 28804, 31121, 32874, 25631, 33157, 25599, 32425, 35875, 23717, 29723, 30667, 29981, 34334, 26511, 29581, 31292, 31548, 31046, 37270, 34168, 37326, 32825, 30746, 26417, 24684, 26090, 29356, 24867, 28751, 28951, 35411, 23686, 23785, 25434, 23224, 24891, 27391, 32603, 35663, 20363, 31622, 21225, 30253, 17140, 25042, 26294, 25820, 24531, 17891, 18268, 20797, 18363, 14513, 17409, 17126, 8157, 10238, 16992, 17367, 9949, 5458, 15449, 10493, 7224, 2442, 8654, 3873, 18557, 13157, 15240, 14804, 10975, 17848, 14273, 15389, 14820, 16152, 13606, 12109, 14567, 15708, 14892, 19311, 21134, 15164, 10940]
596945A9416L824j952J966k337p279P961J313J469j1654M555J17L938P22j1334B3528
581224B3035J350N39k795n661L763n230q66O718M18o849j398O01m147O713k337A3709
564396A3219k213J319j0097J2802n575j131m094O553K388J208r858N480r987J1982A2970
548440G181n378P092j279k168N12K474J721k461N27J0923m466J936l023O249Q560B6281
531358B9829M69j543K145l821K698O521j520M030o77j427n475J3102n213p0P68D7335
514144E4259j233j3811j0683J961K704j0552M982J692l305N910l333j369M684B6457
498843B1692Q307p701M673q368J0346o051k128j07P809l856K372N848K346j061E0087
482407D5838J1112N689J3198L3035K2418K5487L2666K4005N6330J17033J68166G51219
$$ y = [19416, 23240, 21288, 23254, 20917, 13638, 21599, 22912, 24381, 12727, 17282, 17399, 21337, 22059, 10725, 23528, 23035, 24385, 24924, 22129, 16468, 20231, 15001, 14135, 20853, 21271, 14422, 13024, 13625, 9478, 16191, 13854, 13709, 13219, 11006, 12325, 2228, 15030, 9455, 8324, 4230, 10783, 13171, 14379, 4521, 10001, 14, 11996, 12970, 7181, 1803, 8895, 7616, 5448, 5960, 8434, 10155, 7694, 8221, 19144, 14678, 16614, 13591, 19840, 28400, 26281, 29829, 30298, 28755, 30900, 27079, 29777, 36298, 34778, 38808, 38131, 36704, 31229, 44331, 39118, 39048, 39816, 47335, 54259, 53026, 39215, 28532, 30493, 33197, 22645, 27627, 29319, 26014, 31924, 28591, 27222, 31906, 26457, 21692, 29999, 22298, 26971, 18603, 28949, 22898, 20770, 20663, 28472, 24616, 26988, 32836, 35182, 34121, 50087, 45838, 56950, 62639, 75837, 108872, 131290, 156777, 189443, 213448, 269778, 386811, 554977, 751219]
468966H71452l6448j65536j99903j43077r1017n9099k1910k595m101O257j608A27800
455444A01466k8325j4361j3056p002P854m703j925p037k457l827j0471K36K218B0447
439739A1161O558n921O95J0278L808J1296J0740K0709K8702L1073r286j9575m8398C0880
423927A9365r667k606m423L956k785K066n955J2854n771O50K593q240K234k570F851
406939A5941k654k379k529n337L818K541j544k879J2014m985J184M134o215J213A1679
389825H304N353M715j233P48k003p254P832m825j973M873l189k179J952k116P35D8
371505H095K18m996J074N438m7k353J622n006M106J451M864l664R053j453P252C4399
353036C7154K1037J6501K4255K5148M5368N8647M9440J766j8145j6962j5044j4714B17998
$$ y = [871452, 835004, 669468, 469565, 326488, 235471, 176372, 154462, 151867, 147766, 154023, 152415, 127800, 101466, 73141, 58780, 45724, 38722, 46576, 41873, 39948, 32911, 30454, 26627, 16156, 16392, 18610, 20447, 11161, 17719, 11798, 12493, 22771, 26579, 37875, 48615, 69324, 98026, 129099, 119813, 100238, 51840, 30880, 19365, 9698, 7092, 2669, 6625, 3840, 5906, -49, 12805, 7034, 7684, 10277, 2037, 4271, 1701, 6851, 15941, 13287, 10908, 8379, 3042, 6860, 9401, 7857, 4978, 16992, 12007, 13191, 17325, 11110, 12323, 11679, 8304, 13657, 18372, 17139, 17887, 15884, 8630, 16462, 11637, 9664, 14537, 11348, 9169, 11121, 9005, 9740, 48, 8095, 8313, 3317, 4391, 9829, 9782, 7429, 9051, 4045, 8151, 9602, 14466, 10802, 19855, 18402, 25654, 34399, 37154, 58191, 74692, 98947, 124095, 169463, 228110, 277550, 279316, 261171, 244209, 229165, 214451, 217998]
337720B13324J4964K3105K9114L4813J4494k5076o1136p2751l8361m0708k1769G2205
323407E2487q456J991j1698K549k533n463m011L780n471j131l847j990m008q72A6211
305671A0506N847L614j0523m846r71K824M469j0929P01R168O15m293M911j083F868
287804C334j037J4410q160j960K455P066p750J2117J489m292O114P01n63n415B3192
269802B5058k227q320M59l674N704q13J858p160R353J6581M906j3787j673j405A2343
251665A7348P619J607l205J2379J1427J4681O614N021K228j070J5910J7751J2728A09957
234537H9900l1594j0968m667J3498L4939L9495K0943r514m6677m1714l1592r60A7204
218442A6210r793P75o395J1774j2572O935k346P60Q733m521j491M971j129M734A6501
$$ y = [213324, 228288, 251393, 280507, 315320, 329814, 304738, 243602, 170851, 132490, 91782, 70013, 72205, 52487, 44031, 46022, 34324, 36873, 34340, 28877, 24866, 28646, 23175, 22044, 18197, 16207, 12199, 11327, 16211, 10506, 16353, 19967, 9444, 4598, 3627, 6451, 10920, -9, 692, 9860, 10475, 6182, 11093, 10010, 6868, 3334, 2297, 16707, 8547, 6587, 9042, 16108, 8358, 20475, 21964, 17672, 23786, 24487, 23924, 18509, 23192, 25058, 22831, 14511, 14970, 11296, 17000, 16187, 18045, 10885, 20238, 36819, 41725, 27938, 26265, 24860, 12343, 17348, 24967, 26574, 23369, 35748, 47175, 61856, 68470, 73491, 75719, 74649, 90559, 108310, 121038, 109957, 89900, 58306, 47338, 42671, 56169, 91108, 130603, 151546, 142032, 95355, 53641, 22049, 21089, 17204, 16210, 6417, 7192, 797, 12571, -1, 6934, 4588, 5348, 14081, 9560, 8069, 13040, 11911, 16645, 16501]
199918H087K703N22J2493p37l848J2370J9594J9491R189o3L886j2636o436p079E8151
181253F8166K7831J0595L733J930O043J8452M2960P7338R0234P9753M129l5137C17255
164806B43029l8814n34j3977j1190k3875k9773j1398n002j3649k15l3073j7466C5113
148249D6116k543K1466J4998L1972O9806J12199J84678K30119K01230Q4190j04173F66039
132775D38027j85318j14898n6615k8434k1213j6470j1125l954L294J74J6673J8364E2862
116005I0587L6765O5218N1911J6217k727l5915m8050l7227l5690k1933j3277j5376D8130
99123E0101M143J0658J5748K1299K1911L8811O1899R9177J47416J55197J41011H00295
83345G33078j15765j24738r6257o6860j8905o176L3987R8314J46979J52224J30459I29943
$$ y = [8087, 10790, 11312, 23805, 23068, 19220, 31590, 51184, 70675, 79864, 79801, 83687, 71051, 64615, 57536, 58151, 68166, 95997, 106592, 110325, 112255, 118298, 136750, 179710, 257048, 347282, 427035, 431164, 396027, 317255, 243029, 204215, 203681, 189704, 178514, 154639, 124866, 113468, 108466, 94817, 94602, 61529, 44063, 35113, 46116, 43573, 65039, 80037, 112009, 181815, 294014, 478692, 708811, 910041, 994231, 890058, 666039, 438027, 252709, 137811, 81196, 52762, 31549, 15079, 3954, 0, 3294, 3468, 20141, 38505, 52862, 90587, 127352, 192570, 244481, 260698, 257971, 222056, 174006, 136779, 101089, 79156, 65879, 50503, 48130, 50101, 54244, 64902, 80650, 101949, 123860, 162671, 224570, 323747, 471163, 626360, 767371, 800295, 733078, 617313, 492575, 396318, 329458, 310553, 304377, 338364, 436678, 583657, 735881, 866340, 929943]
67469I33545H73287
$$ y = [933545, 873287]
##END=