##TITLE= Raman spectrum of Manganite � http://rdrs.uaic.ro
##MINERAL= Manganite
##CHEMISTRY= MnO(OH)
##JCAMP-DX= 5.01
##DATA TYPE= RAMAN SPECTRUM
##DATA CLASS= XYDATA
##ORIGIN= Department of Geology, UAIC, Romania
##OWNER= http://rdrs.uaic.ro � stud. Apopei Andrei Ionut
##LONGDATE= 2010/06/01 12:25:38.0909 +0300 $$ export date from JSpecView
##SPECTROGRAPHDATASYSTEM= HE 532 (Horiba Jobin-Yvon)
##XUNITS= Raman shift (1/cm)
##YUNITS= Intensity (cnt)
##XFACTOR= 3.188909E-3
##YFACTOR= 9.6937327E-4
##FIRSTX= 3399.61
##FIRSTY= 0
##LASTX= 210.701
##NPOINTS= 1024
##XYDATA= (X++(Y..Y))
1066073@J5869k531m201q525N759L02j368k591J1127k442q317L552L104j279J285I508
$$ 0 15869 13338 9137 612 6371 6673 5305 2714 13841 11399 3082 6634 9738 8459 9744 9508
1052896D739m739J3455l812L047O207o050l544k592L02N997r869J434K208R56m740G264
$$ 4739 0 13455 9643 12690 18897 12847 9303 6711 7013 13010 3141 4575 6783 7739 2999 7264
1039622E177Q05m461M722l719M811J739r445n88L170K782m227L527L96J290J081H201
$$ 5177 5982 1521 6243 2524 7335 9074 -371 -959 2211 4993 766 4293 4689 5979 7060 8201
1026251a543L586n30j633Q42J676L489l310j700O412p843j133M234N219q35k624H77
$$ -1543 2043 1513 -120 722 2398 5887 2577 877 7289 -554 -1687 2547 7766 6931 4307 877
1012782d312P903k743M503l847n935O233k565O293L876p634n815N755K177K833G289
$$ -4312 3591 848 5351 1504 -4431 1802 -763 5530 9406 1772 -4043 1712 3889 6722 7289
1000013F573n845J253P545n517L310j0766N726L101M384m861n815P485M474p665E023
$$ 6573 728 1981 9526 4009 7319 -3447 2279 5380 9764 4903 -912 6573 11047 3382 5023
987156B607j044P46J46O89M119k383K121K72o83K061R605j786p482J405M297q526A1237
$$ 2607 1563 2309 2455 3144 7263 4880 7001 7273 6590 8651 18256 16470 8988 10393 14690 6164 11237
972587C635l635K162k162N248k953O54N66N425m803J1330j0261L456o2k718r904d085
$$ 3635 0 2162 0 5248 2295 2949 3515 8940 4137 15467 5206 8662 8600 5882 -4022 -4085
958720C008Q287k271k629q803Q792o178k481P210j4082P505M8n679M163M64j653f608
$$ 3008 11295 9024 6395 -2408 6384 206 -2275 4935 -9147 -1642 -1594 -7273 -3110 -2646 -4299 -6608
944753e070N235J657j087r049M877K968O72J089l473j64m073J812R387n613j468e676
$$ -5070 165 1822 735 -8314 -3437 -469 203 1292 -2181 -2345 -6418 -4606 4781 -832 -2300 -5676
930679F664m061p640j227J5473o714N125J994j405j046O498j3661J1725o734k292D492
$$ 6664 2603 -5037 -6264 9209 2495 7620 9614 8209 7163 13661 0 11725 4991 2699 4492
917339E540n484N879K239p483K716M714r446O693o308k074M576k730j686L025A0234
$$ 5540 56 5935 8174 691 3407 8121 -1325 5368 -940 -3014 1562 -1168 -2854 171 10234
903905A0099n24J773m401N322j4302l506N143L950M729J061m59j0302K730j027A316
$$ 10099 9575 11348 6947 12269 -2033 -5539 -396 3554 8283 9344 8885 -1417 1313 286 1316
890377A123r68n443R021l385k401q873J0720j1140J4357p59K009j2545J3282r73C469
$$ 1123 155 -5288 3733 348 -2053 -10926 -206 -11346 3011 2252 4261 -8284 4998 4025 3469
876754F075q190J174K80J3759j0784j360K547j2126Q601L173O09M306k075K279H966
$$ 6075 -2115 -941 -661 13098 2314 954 3501 -8625 -24 3149 3758 8064 5989 8268 8966
863035D297R049o668o350L328n19k785Q964j712p945Q069n530N742p767J359j206G052
$$ 4297 13346 6678 328 3656 3137 352 9316 7604 -341 7728 2198 7940 173 1532 326 7052
848353B982R70N115o068k937o456k431K282k372J745m33R329j985M457J952r619b114
$$ 2982 3952 9067 2999 62 -6394 -8825 -6543 -8915 -7170 -7603 1726 -259 4198 6150 -3469 -2114
833561b935P856p143J594N80j95l44j119J028N173j388n294M994q664J833O188A0021
$$ -2935 4921 -2222 -628 -48 -243 -587 -1706 -678 4495 3107 -2187 2807 -5857 -4024 2164 10021
818656c832J685j805j238Q185J655m906k580O695o278K013M458M429n536k207F49
$$ -3832 -2147 -3952 -5190 2995 4650 -256 -2836 3859 -2419 -406 4052 8481 2945 738 649
804529a200J880r24L59O741q64j132K984n813L1P338n425j162l674K562j701M633A2159
$$ -1200 680 -244 115 6856 5992 4860 7844 2031 2062 9400 3975 2813 -861 1701 0 4633 12159
788514I963J799m135M453n508l152m315N853r45Q43K304K393r178J1370n153n361a476
$$ 9963 11762 7627 12080 6572 3420 -895 4958 4013 4856 7160 9553 375 11745 6592 1231 -1476
773271B407j1630R364o86J432q9M026m294m949N279j609J0289M683l756m174m382I547
$$ 2407 -9223 141 -545 887 798 4824 530 -4419 860 -749 9540 14223 10467 6293 1911 9547
757911C495M237L044o738L593K873q460m107M810M780l302N972j513k3k886P22C402
$$ 3495 7732 10776 4038 7631 10504 2044 -2063 2747 7527 4225 10197 8684 8661 5775 6497 3402
742439b109J0652j277J943J794p899J622m171P131l068j428Q09L104K5620n455B1247
$$ -2109 8543 7266 9209 11003 3104 4726 555 7686 4618 3190 3999 7103 32723 27268 21247
727766A0842q766O921m620q915N98K239Q6K415o680K177J044M742j49l370L340a854
$$ 10842 2076 8997 4377 -4538 -3940 -1701 -1615 800 -5880 -3703 -2659 2083 1934 -1436 1904 -1854
712065E453R84j491K445l966o352J0408p694K147j0023Q839J771O335p384k910g032
$$ 5453 6437 4946 7391 3425 -2927 7481 -213 1934 -8089 750 2521 8856 1472 -1438 -7032
697176d484L830m103J3612M61M576j985j895j1318p352P619K862O220L268m725A3432
$$ -4484 -654 -4757 8855 9316 13892 11907 10012 -1306 -8658 -1039 1823 8043 11311 6586 13432
682180D711M311p677L565n51k727J0036j2032J030K014l622J119J536o038J477D235
$$ 4711 9022 1345 4910 4359 1632 11668 -364 666 2680 -942 177 1713 -4325 -2848 4235
667078F039L43L862j924o269k249O698m485N564n976J0127k249n290m009m187D213
$$ 6039 6382 10244 8320 2051 -198 6500 2015 7579 1603 11730 9481 4191 182 -4005 4213
651866D439p915Q129p140N356o365P055K26j533j2657J2512r138o99R053l494C165
$$ 4439 -3476 4653 -2487 2869 -3496 3559 3785 2252 -10405 2107 -7031 -7730 1323 -2171 3165
636544F830j821k536L26l848l132N36o27L579j014j461J373M48k056O413J940b8
$$ 6830 5009 2473 2799 -1049 -4181 -3645 -4272 -693 -1707 -3168 -1795 -1347 -3403 3010 4950 -28
620143A764M178k234j308Q234J167m440p361J4575n705m005J004O253q16n259C949
$$ 1764 5942 3708 2400 10634 11801 7361 0 14575 8870 4865 5869 12122 11306 6047 3949
604592I336l292N803p169L15K55N266k489K074n173q706N071J21J164n367N547a271
$$ 9336 6044 11847 4678 4993 5248 10514 8025 10099 4926 -3780 1291 1412 2576 -2791 2756 -1271
587947B695K9m534q740M799j613q293J2027K343M222k81p467L270j294Q906k932e12
$$ 2695 2724 -1810 -10550 -5751 -7364 -15657 -3630 -1287 2935 2654 -4813 -1543 -2837 6069 3137 -512
571173G61l826P715n346m55M69n643P99J0193l681K744j611J134j134K39J908H322
$$ 761 -3065 4650 -696 -1151 -682 -6325 -5526 4667 986 3730 2119 3253 2119 2358 4266 8322
554268b354O322j3807J640J0825m026l847O263q05N606L0J044r513P45J820N175c992
$$ -2354 3968 -9839 -8199 2626 -1400 -5247 1016 211 5817 5847 6891 -2622 -1877 -57 5118 -3992
537234F223n948m547L446j237P591j624m3o395N146N355J776p617L804K045m904g677
$$ 6223 275 -4272 -826 -2063 5528 3904 3861 -2534 2612 7967 9743 2126 5930 7975 3071 -7677
520068a875Q815q541k68L743m122M331r69j385J363K459k395K30K571l521J631b830
$$ -1875 6940 -1601 -1869 1874 -2248 2083 1114 -271 1092 3551 1156 1386 3957 436 2067 -2830
502768A246l156J079n33M039l366J946j305r73l528M569j126N17J214N209m776F597
$$ 1246 -1910 -831 -1364 2675 -691 1255 -50 -1023 -4551 18 -1108 -591 623 5832 1056 6597
485332A0826j1696O562l677L94L103n277J360K290l807K057L369p18n686N170B718
$$ 10826 -870 5692 2015 2409 5512 235 1595 3885 78 2135 5504 4786 -900 4270 2718
468797C850l401N194m374r62L34N317o21j993k082j523p73O504k854k915O295B181
$$ 3850 449 5643 1269 307 641 5958 5337 3344 1262 -261 -1034 5470 2616 -299 5996 2181
451098g98J825K95M501n111P208p797O76j267l96Q819r56p189M389l313L040l728A1985
$$ -798 1027 1322 5823 712 7920 123 799 -468 -864 7955 6999 -190 4199 886 3926 198 11985
432204E222j366l514L495l361O034n56n954N409n733M784j388p03r47q70l92L336B180
$$ 5222 3856 342 3837 476 6510 5954 0 5409 -324 4460 3072 2369 1422 552 160 3496 2180
413157B842k97k8k001N036k358j347K204k608J288M439q175J338L216o405L241B352
$$ 2842 2545 2517 516 5552 3194 1847 4051 1443 2731 7170 -1005 333 3549 -2856 385 2352
395019D344l348m88p26L10R163q811J911K627m143Q383r152L446M10O016j0773H379
$$ 4344 996 508 -218 92 9255 444 2355 4982 839 9222 70 3516 3926 9942 -831 8379
376740B602j473O537j0281O092l897L912N24l257J765M628k917J467o733P983E927
$$ 2602 1129 7666 -2615 3477 -420 3492 4016 759 2524 7152 4235 5702 -1031 6952 5927
359402B635O15l501M500k551l90j317K79j190J2988j2716N691L619j779n865J571f20
$$ 2635 3250 -251 4249 1698 1308 -9 270 -920 12068 -648 5043 8662 6883 1018 2589 -620
340841A127K760j869p61j425n49P388m755J284l745N125l62m591P927k360o177E81
$$ 1127 3887 2018 1257 -168 -717 6671 1916 3200 -545 4580 4218 -373 7554 5194 -983 581
322132G923q492R869l104n967J855k325K6N186J638o325J259j927N110J143K157B520
$$ 7923 -569 9300 6196 229 2084 -241 -215 4971 6609 284 1543 -384 4726 5869 8026 2520
303276F288j957R66n297M365K604o936M160n462J118K640J654k968J863l625N959D76
$$ 6288 4331 5297 0 4365 6969 33 4193 -1269 -151 2489 4143 1175 3038 -587 5372 476
284269C665k826j692L839k546J46O52J069N14n33k633J1067q914j853O919o561a784
$$ 3665 839 -853 2986 440 586 1238 2307 2821 2288 -345 10722 1808 -45 6874 313 -1784
265111B613m569Q198l13o634O586n760N01O487o152L242m006J23R034q439qK852C979
$$ 2613 -1956 6242 5929 -705 5881 121 622 7109 957 4199 193 316 9350 911 903 3755 3979
244659A797l016K863k038J773o23l49J110p00p89J925k668M668J985M35P949K432H899
$$ 1797 -1219 1644 -394 1379 756 407 1517 817 28 1953 -715 3953 5938 6373 14322 16754 8899
224034G902n977K702K493m814Q219K673k755o692R979k546O729J719J0964J0338D5665
$$ 7902 1925 4627 7120 2306 10525 13198 10443 3751 13730 11184 17913 19632 30596 40934 45665
205552E9343J2992J5438K9245K8351M8123P0430Q4893Q6176P2695J216o1235q3777B68811
$$ 59343 72335 87773 117018 145369 193492 263922 348815 434991 507686 508902 447667 363890 268811
189267B09786l7762k4402j3815J9019K3522L5809M7886P9378J20920J56348J58021I19308
$$ 209786 172024 147622 133807 152826 176348 212157 260043 339421 460341 616689 774710 919308
174048I84343m8376j06977j00713n7919Q197J9437R329m4588j10464j12849r8595B45420
$$ 984343 935967 828990 728277 670358 678555 697992 707321 662733 552269 439420 340825 245420
158735A85922o1079j7032j8105p459k2489j733j6047j2289j4258m208j821J936A1604
$$ 185922 124843 107811 89706 82247 59758 58025 41978 29689 15431 11223 9402 11338 11604
142139E787n787j330k58m045N735r297l660K332O178l007J0590K448J2496J4673H7727
$$ 5787 0 -1330 -1588 -5633 102 -9195 -12855 -10523 -4345 -7352 3238 5686 18182 32855 87727
123036A46027N3588J6548l4478n3982m2085j140K2926O4972L3928n528l2726m1971G7068
$$ 146027 199615 216163 181685 127703 85618 84478 107404 172376 206304 200776 168050 126079 77068
106202D0433k0295p293o309p810J337J961L332J2754K1402K1252L0347L8308R081A56826
$$ 40433 20138 12845 6536 -1274 63 2024 5356 18110 39512 60764 91111 129419 138500 156826
88040A50934k2175J5339R464O451J0714M392j4518k3375j9589n0575k8359k8121B440
$$ 150934 128759 144098 153562 160013 170727 175119 160601 137226 117637 67062 38703 10582 2440
70971A962J2225J218A4941
$$ 1962 14187 15405 14941
66073e187  $$checkpoint
##END=