##TITLE= Raman spectrum of Melanterite � http://rdrs.uaic.ro
##MINERAL= Melanterite
##CHEMISTRY= Fe2+SO4*7(H2O)
##JCAMP-DX= 5.01
##DATA TYPE= RAMAN SPECTRUM
##DATA CLASS= XYDATA
##ORIGIN= Department of Geology, UAIC, Romania
##OWNER= http://rdrs.uaic.ro � stud. Apopei Andrei Ionut
##LONGDATE= 2009/11/09 01:01:21.0453 +0200 $$ export date from JSpecView
##XUNITS= Raman shift (1/cm)
##YUNITS= Intensity (cnt)
##XFACTOR= 3.188736E-3
##YFACTOR= 2.82137164E-4
##FIRSTX= 3399.97
##FIRSTY= 35.80142456
##LASTX= 211.234
##NPOINTS= 1024
##XYDATA= (X++(Y..Y))
1066244 126894 140085 143493 150025 156315 163089 170383 174309 168742 163949 154061 149193 142202 139024 135783 135141
1053844 129221 120850 111909 108198 105855 106667 102034 105798 101060 99719 98403 97711 100065 95561 84107 79900
1041359 83194 81692 85394 82122 80372 75174 74612 74372 73723 71893 66869 65434 63999 62562 61125 59688 58250
1027997 56811 55371 53478 51557 49635 47713 47649 47361 47072 46783 46494 46205 42163 37821 33475 35161 34074 32987
1013743 31899 30812 29723 27337 24916 22494 20070 19807 19184 18560 17936 17312 16687 16062 15437 14811 12384 11758
999380 11131 10919 10919 10919 9867 9104 8340 7577 5448 5066 4683 4301 3918 3535 3152 2769 2386 2002 2178 2178 2178 2178 2178
980862 2178 2178 2178 2178 2178 2178 2178 2178 2178 2178 2178 2178 2178 2178 2178 2178 2178 2178 2178 2178 2178 2178 2178 2178 2276 2391 2506 2622 2737 2852 2968 3083 3199 3314 3430 3546 3661
950684 3777 3893 4009 4125 4241 4357 4473 4589 4705 4822 4938 5054 5171 5287 5404 5520 5637 5753 5870 5987 5989
933335 5989 5989 5989 5989 5989 5989 5989 5989 5989 5989 5989 5989 5989 5989 5989 5989 5989 5989 5989 5989 5989 5989 5989 5989 5989 5989 5989 5989 5989 5989 5989 5989 5989 5989 5989 5989 5989 5989 5989 5989 5989 5989 5989 5989 5989 5989 5989 5989 5989 5989 5989 5989 5989 5989 5989 5989 5989 5989
884595 5989 5989 5989 5989 5989 5989 5989 5989 5989 5989 5989 5989 5989 9089 9089 9089 9089 5329 5721 6112 6504 6896 7269 7400 7531 7662 7793 7924 8055 9089
858895 9089 9089 9089 9089 9089 9089 9089 9089 9089 9089 5989 5989 5989 5989 5989 5989 5989 5989 5989 5989 5989 5989 5989 5989 5989 5989 5989 5989 5989 5989 5989 5989 5989 5989 5989 5989 5989 5989 5989 5989 5989 5989 5989 5989 5989 5989 5989 5989 5989 5989 5989 5989 5989 5989 5989
810889 5989 5989 5989 5989 5989 5989 5989 5989 5989 5989 5989 5989 5989 5989 5989 5989 5989 5989 5989 5989 5989 5989 5989 5989 5989 5989 5989 5989 5989 5989 5989 5989 5989 5989 5989 5989 5989 5989 5989 5989 5989 5989 5989 5989 5989 5989 5989 5989 5989 5989 5989 5989 5989 5989 5989 5989 5989 5989
758987 5989 5989 5989 5989 5989 5989 5989 5989 5989 5989 5989 5989 5989 5989 5989 5989 5989 5989 5989 5989 5989 5989 5989 5989 5989 5989 5989 5989 5989 5989 5989 5989 5989 5989 5989 5989 5989 5989 5989 5989 5989 5989 5989 5989 5989 5989 5989 5989 5989 5989 5989 5989 5989 5989 5989 5989 5989 5989
705731 5989 5989 5989 5989 5989 5989 5989 5989 5989 5989 5989 5989 5989 5989 5989 5989 5989 5989 5989 5989 5989 5989 5989 5989 5989 5989 5989 5989 5989 5989 5989 5989 5989 5989 5989 5989 5989 5989 5989 5989 5989 5989 5989 5989 7260 7260 7260 7260 7260 7260 7999 7637 7275
655846 6913 6551 6188 5826 6831 6831 6831 6831 6831 6831 6831 6831 6831 6831 6831 6831 6831 6831 6831 6831 6831 6831 6831 6831 6831 6831 6831 6831 6831 6831 6831 6831 6831 6831 6831 6831 6831 6831 6831 6831 6831 6831 6831 6831 6831 6831 6831 6831 6831
608658 6831 6831 6831 6831 6831 6831 6831 6831 6831 6831 6831 6831 6831 6831 6831 6831 6831 6831 6831 6831 6831 6831 6831 6831 6831 6831 6831 6831 6831 6831 6831 6831 6831 6831 6831 6831 6831 6831 6831 6831 6831 6831 6831 6831 6831 6831 6831 6831 6831 6831 4084 4084 4084 4084 4084
554436 4084 4084 4084 4084 4084 4084 4084 4084 4084 4084 4084 4084 4084 4084 4084 4084 4084 4084 4084 4084 4084 4084 4084 4084 4084 4084 4084 2473 -918 -918 -918 -918 -918 -918 -918 -918 -918 -918 -918 -918 -918 -918 -918 -918 -918 -918 -918 -918 -918 -918 -918 -918
501914 -918 -918 -918 -918 -918 -918 -918 -918 -918 -918 -918 -918 -918 -918 -918 -918 -918 -918 -918 -918 -918 -918 -918 -918 -918 -918 -918 -918 -918 -918 -918 -918 -918 -918 -918 -918 -918 -918 -918 -918 -918 -918 -918 -918 -918 -918 -918 -918 -918 -918 -918 -918 -918 -918 -918 -918 -918 -918 -918
440789 -918 -918 -918 -918 -918 -918 -918 -918 -918 -918 -918 -918 -918 -918 -918 -918 -918 -918 -918 -918 -918 -918 -918 -918 -918 -918 -918 -918 -918 -918 -918 -918 -918 -918 -918 -918 -1042 -1320 -2263 -918 -918 -918 -918 -918 -918 -918 -918 -918 -918 -918
387677 -918 -918 -918 -918 -918 -918 -1457 -1485 2157 1912 -1112 1009 6405 8447 11503 16255 17838 18598 17025 19833 23222 22923
363918 27495 35037 46119 55065 60639 51179 33327 21416 15310 10603 1105 -870 6916 9981 10804
347577 13410 26382 28733 28559 30087 32938 35741 36871 39147 42425 43147 38787 29965 21247 12468 6566
330024 2843 -405 -361 -1260 -345 1707 2659 5395 4765 1046 2192 11496 26704 51587 112835 328730 716437
311228 996789 873567 476010 187919 87070 56250 41255 32915 26920 25481 22143 17233 5992
296754 37 -844 -1474 -33 632 1756 1155 -1282 1003 2462 3047 1160 -1636 -542 -3211 -957 1096 1133
276568 -1113 -476 601 1356 121 2346 1075 330 -848 -1604 243 -976 -927 280 -1058 -2489 23 -1127
256211 2480 148 -697 -973 -660 375 -521 -2128 -1244 2406 108 -541 2546 262 -344 139 -966 -1708
235683 182 1319 429 84 -1385 277 430 -1348 895 4684 2250 810 78 3997 10936 16338 21568 21933
214980 21958 28060 30338 31216 32980 32707 31977 33691 29581 34006 36945 39587 44005 41220 44549 50848 51961
195265 55606 60067 68341 70054 70381 64928 56869 55679 50009 52199 49140 42516 39154 37884 33928 33765
176565 28726 25586 22286 18763 15171 10385 4832 -525 1004 2592 3469 2864 1757 -500 1651 2118 5445
156541 10189 26097 49352 76412 92951 93794 78248 61254 46915 45189 47918 48500 46340 38454 27579
138738 13696 7976 1277 1089 1252 1905 -763 1754 -147 161 -2141 -2746 -1761 -1118 -1959 1129 -530 -428
117207 -692 777 1165 1594 666 -82 2158 617 2558 2862 1540 1397 -290 958 659 -690 785 1018
95490 166 19 1951 7893 8673 14064 12145 7317 6785 1981 315 1211 386 3881 7864 12417 15966 15703
73587 18473 18766 19269 22025 30227 32005
66244C2439  $$checkpoint
##END=