##TITLE= Microcline no. 6028 (Amazonite) and 6029 � http://rdrs.uaic.ro
##JCAMP-DX= 5.01
##DATA TYPE= LINK
##ORIGIN= Department of Geology, UAIC, Romania
##OWNER= http://rdrs.uaic.ro � stud. Apopei Andrei Ionut
##BLOCKS= 2
##TITLE= Raman spectrum of Amazonite (no. 6028) � http://rdrs.uaic.ro
##MINERAL= Amazonite (var. Microcline)
##CHEMISTRY= KAlSi3O8
##JCAMP-DX= 5.01
##DATA TYPE= RAMAN SPECTRUM
##DATA CLASS= XYDATA
##BLOCK_ID=1
##ORIGIN= Department of Geology, UAIC, Romania
##OWNER= http://rdrs.uaic.ro � stud. Apopei Andrei Ionut
##LONGDATE= 2011/10/14 10:01:25.0584 +0300 $$ export date from JSpecView
##XUNITS= Raman shift (1/cm)
##YUNITS= Intensity (cnt)
##XFACTOR= 3.188909E-3
##YFACTOR= 2.8316701E-3
##FIRSTX= 3399.61
##FIRSTY= 5576.20749232
##LASTX= 210.701
##NPOINTS= 1024
##XYDATA= (X++(Y..Y))
1066073 1969229 2009987 2007010 1995241 2003023 2007231 2010915 2003464 2002159 1999265 1994101 1993890 1992273 1985906 1988864
1054452 1990316 1986907 1978270 1978757 1977296 1978243 1989020 1988129 1989994 1989976 1990610 1992640 1998640 2003978 1998888 1996656 1998438
1041190 1998052 1996637 2002655 2004741 2001645 1990215 1992999 1998962 2005577 2003942 2000064 1997143 1994230 1988432 1990417
1029405 1992613 1989719 2001001 2004392 2007957 2007608 2001874 1996426 2002334 2005007 2004061 2011715 2011761 2007424 2004181 2011310
1016755 2014315 2017981 2024256 2027252 2021417 2017154 2012174 2006946 2004677 2007672 2011007 2015418 2021353 2018257 2014462 2011605
1004014 2004741 2007553 2011871 2007617 2015454 2014030 2025139 2035328 2039481 2034033 2033150 2034317 2034703 2039665 2040666 2039683
991185 2044489 2038994 2037441 2038581 2042366 2036330 2029723 2042118 2043028 2039169 2037800 2038856 2044654 2046005 2037662 2043579
978266 2041677 2047511 2056672 2063894 2058252 2055505 2058831 2065842 2070619 2073385 2060062 2067596 2065961 2077207 2071924
966073 2067587 2063002 2070399 2070454 2067936 2067826 2065382 2067036 2067330 2063591 2075094 2074341 2068194 2067220 2069407 2073367 2068864
952160 2079559 2087149 2091118 2082619 2084512 2090291 2091412 2092432 2097798 2092597 2090410 2093920 2091412 2086597 2084025 2086120
938970 2086616 2080120 2077253 2083428 2084254 2077308 2079366 2082426 2076922 2076141 2084861 2083841 2087599 2084530 2091191 2086101
925686 2089335 2083685 2094949 2092790 2094674 2095004 2093479 2091127 2093957 2094664 2080405 2081296 2078558 2081764 2080892 2082803
912312 2085963 2078686 2079633 2082049 2082215 2089593 2089538 2090392 2094076 2097109 2097494 2092634 2098239 2093213 2096971 2092992 2093957
897997 2109485 2105672 2108437 2104725 2105727 2101932 2098395 2098753 2093553 2094122 2099451 2096566 2099360 2097641 2094168 2098753
884428 2102116 2104064 2105019 2103678 2107969 2112894 2114116 2113491 2108548 2109549 2113013 2118131 2114162 2107776 2102823 2104330
870765 2105001 2106269 2100232 2099727 2092211 2098983 2101730 2101693 2101583 2095776 2094086 2100379 2096089 2099222 2099378 2107987 2104376
856139 2099948 2099608 2104496 2105176 2099350 2103898 2105993 2105268 2112508 2106554 2103549 2100940 2101105 2101004 2096410 2090631 2089611
841407 2097577 2102070 2096245 2096539 2096401 2098000 2101409 2094646 2107289 2109393 2112039 2109972 2101739 2103862 2109512 2110799
827437 2112572 2113950 2114805 2110946 2118149 2110183 2108832 2109264 2104487 2111341 2107087 2108483 2103182 2102897 2107289 2107914
813372 2100756 2104018 2106379 2106719 2109062 2115696 2116486 2118168 2122973 2112673 2111019 2116642 2117855 2118296 2109182 2108906
799204 2107519 2112517 2111451 2110964 2112728 2105920 2103990 2104009 2102548 2099718 2101179 2104174 2108676 2096511 2101951 2114189
784936 2097283 2100113 2098772 2102925 2104431 2109917 2118949 2104992 2105598 2104036 2111892 2103660 2099856 2099700 2100922 2093121
770568 2097623 2095436 2093691 2093939 2106012 2105111 2105727 2116743 2113721 2119564 2122054 2117919 2119582 2112535 2116431 2124030
756099 2109274 2116266 2123754 2124158 2121126 2118710 2120244 2124268 2115659 2119849 2119344 2116036 2122881 2131904 2139006 2141625
741526 2140605 2147294 2152200 2156031 2149122 2146770 2150335 2145787 2149471 2156427 2153927 2156721 2157446 2147946 2153202 2154405
726847 2140063 2144344 2132179 2136066 2136461 2147349 2141395 2132804 2135110 2134430 2138197 2139227 2137058 2147376 2140807
712990 2144969 2141882 2136020 2131904 2137049 2137977 2139521 2137086 2125573 2123166 2124388 2127741 2124507 2121108 2119224 2115356
698110 2113463 2112921 2109696 2114943 2119849 2123524 2126869 2118829 2128835 2130948 2127659 2115117 2119040 2119840 2122045 2115531
683121 2128495 2124002 2114667 2112149 2103853 2108134 2119040 2113050 2124351 2114998 2131003 2127181 2126850 2125334 2131481
668972 2128807 2132859 2141772 2137334 2127438 2130700 2136443 2135662 2137738 2127034 2135129 2134945 2130709 2131251 2128302 2117267
653772 2122376 2124737 2120437 2122504 2126290 2122311 2119132 2113610 2112783 2121007 2121255 2124397 2127769 2118416 2112820 2117350
638466 2114483 2107803 2105268 2101877 2102879 2104606 2096998 2087737 2084613 2080074 2082904 2090254 2081452 2085063 2083951 2087424
623047 2085660 2087415 2084098 2074138 2079219 2082821 2079210 2077382 2084098 2078631 2082518 2090015 2079431 2080726 2079173
608490 2075811 2069572 2075425 2082279 2084273 2085559 2089822 2089832 2092818 2091531 2087351 2088692 2079238 2082077 2092652 2101023
592858 2100646 2092744 2097265 2097641 2091191 2089354 2088095 2083078 2083170 2073560 2072273 2076132 2075379 2075912 2069498 2070151 2063646
576119 2058133 2053236 2054476 2054366 2053713 2042853 2042090 2039757 2036284 2037552 2027638 2037836 2033445 2022235 2016630 2007396
560251 2010888 2010015 2009427 2007736 2002012 2004254 1993780 1993651 2000432 1997639 1997023 1998870 1993127 1999476 2000037 1988671 1983342
543261 1982846 1983857 1975385 1974375 1975247 1974935 1976975 1978849 1976883 1981045 1980834 1981697 1978086 1975780 1975514 1975450 1977011
526142 1973860 1972142 1979952 1972528 1967851 1970800 1972693 1968742 1959315 1958093 1952286 1944036 1939855 1934572 1943346 1939671
509908 1932321 1928260 1919669 1916370 1911887 1911666 1910260 1901642 1899253 1895321 1896267 1893538 1889927 1880427 1871082 1863236
493554 1860250 1853524 1855766 1850814 1847827 1846192 1846514 1841304 1839347 1830820 1831436 1830876 1840725 1835424 1827384 1831629
477079 1831592 1833825 1826272 1826741 1820998 1820493 1819345 1811351 1810800 1825344 1814015 1815109 1812555 1808852 1813124 1816864
460487 1813510 1809504 1811176 1802907 1801942 1805287 1800950 1796659 1798625 1801216 1799214 1792378 1780479 1780341 1767055 1766587
443769 1756939 1754183 1749616 1751601 1750590 1741035 1738820 1739555 1740823 1735017 1725617 1720261 1719406 1712120 1701076 1700727
426930 1698494 1698320 1695389 1690923 1689251 1685851 1681965 1677270 1678106 1675432 1674366 1670002 1677499 1681046 1675717 1675781
409965 1670516 1672970 1672501 1670471 1669671 1666492 1663341 1660070 1663258 1652958 1661742 1664673 1652058 1649035 1650000 1646352
392874 1644073 1645029 1639865 1638763 1641409 1633277 1633994 1634040 1630401 1623905 1618797 1611695 1604298 1601174 1595919 1592519 1591747
374580 1588366 1586639 1581503 1578121 1570385 1570321 1569981 1571782 1572259 1566113 1565240 1563990 1566949 1569430 1575990 1587649 1595772
356137 1587980 1592629 1588109 1591407 1585968 1575898 1561362 1553819 1555105 1548784 1557219 1553406 1547130 1539431 1536435
339743 1530426 1531501 1533477 1520953 1520567 1525116 1520476 1521606 1520816 1520430 1516139 1511141 1509670 1509220 1511839 1512951
322132 1504663 1503064 1493380 1488850 1490789 1504084 1521422 1524959 1536803 1538025 1526962 1498296 1473911 1474986
306615 1462021 1460174 1449994 1447789 1446310 1445428 1443406 1442056 1441422 1437085 1439970 1441449 1437838 1432537 1435532 1435955
288755 1433860 1434448 1434659 1437866 1431122 1430212 1424111 1426252 1424332 1420895 1426096 1424607 1428384 1429982 1428843 1426417
270762 1422026 1420638 1418396 1411156 1416816 1410642 1412286 1410338 1414776 1413150 1417101 1430763 1455884 1485818 1490412
253770 1473304 1448248 1423790 1413811 1407022 1399772 1397751 1399359 1398026 1401582 1401003 1408813 1416458 1424166 1450453
236658 1481426 1510167 1510010 1475234 1427548 1403355 1385273 1381212 1371896 1367926 1367522 1364858 1364637 1360107 1357434
219426 1358904 1357599 1353850 1353584 1347363 1348907 1352288 1356588 1355624 1362845 1372006 1383932 1399763 1398844 1395224 1386890
200910 1377454 1369452 1360319 1355366 1353501 1347097 1339177 1333728 1334307 1328831 1327876 1323612 1319312 1320507 1322776 1322914
182254 1319211 1311264 1308884 1301782 1298786 1300137 1292318 1288128 1290581 1292456 1296535 1293457 1309059 1342466 1412838
164636 1550502 1754210 1942933 2010502 1880381 1667668 1475877 1370618 1345783 1378557 1444104 1519217
150451 1573353 1573968 1518693 1440172 1397705 1403934 1417064 1413113 1367044 1306238 1261115 1232311 1217150 1205693
133799 1205096 1214688 1230730 1245321 1254564 1250917 1247958 1228415 1206777 1185856 1187262 1188879 1197791 1205463
117037 1206364 1198462 1190790 1182741 1183099 1171284 1168739 1166184 1175280 1182511 1193657 1199601 1183228 1172919 1168500
98952 1166929 1180389 1196937 1215864 1248969 1296388 1358610 1394627 1402574 1366612 1337146 1333710 1357783
83175 1379329 1381874 1348778 1288955 1243888 1209625 1181740 1168876 1157446 1157704 1169363 1176778 1193537 1202064
66073A218593  $$checkpoint
##END=
##TITLE= Raman spectrum of Microcline (no. 6029) � http://rdrs.uaic.ro
##MINERAL= Microcline
##CHEMISTRY= KAlSi3O8
##JCAMP-DX= 5.01
##DATA TYPE= RAMAN SPECTRUM
##DATA CLASS= XYDATA
##BLOCK_ID=2
##ORIGIN= Department of Geology, UAIC, Romania
##OWNER= http://rdrs.uaic.ro � stud. Apopei Andrei Ionut
##LONGDATE= 2011/10/14 10:05:35.0487 +0300 $$ export date from JSpecView
##XUNITS= Raman shift (1/cm)
##YUNITS= Intensity (cnt)
##XFACTOR= 3.188909E-3
##YFACTOR= 3.19690773E-3
##FIRSTX= 3399.61
##FIRSTY= 3909.65449607
##LASTX= 210.701
##NPOINTS= 1024
##XYDATA= (X++(Y..Y))
1066073 1565799 1603175 1597965 1593484 1599965 1606457 1605530 1600830 1603581 1596714 1598611 1596579 1597162 1586972 1588139 1592515
1053674 1587128 1580334 1583877 1578678 1573249 1573926 1578021 1576416 1574572 1576083 1579480 1585086 1585857 1585815 1587201 1586826 1582262
1040406 1581585 1588576 1592338 1592255 1583731 1585482 1592703 1593130 1591671 1593213 1588055 1585492 1581335 1587222 1581251 1579574
1027831 1586034 1588306 1587618 1588576 1584054 1581793 1577698 1578042 1585096 1590525 1586284 1586909 1583575 1587191 1594672 1593943 1597131
1014372 1600455 1601966 1603060 1601435 1596548 1594089 1593630 1592765 1602081 1599747 1594755 1593349 1588608 1584211 1586336 1590379
1001615 1584481 1586201 1589097 1594485 1597037 1600757 1602091 1596454 1600361 1602299 1603915 1605603 1609208 1609531 1608197 1607447
988768 1610458 1612636 1607072 1604133 1609062 1615033 1613428 1607405 1610312 1609375 1606738 1601028 1602268 1603498 1605196 1613886
975832 1610927 1605540 1605686 1604738 1615762 1618898 1625119 1618982 1624515 1621983 1625869 1629120 1626599 1628589 1634361 1635424
962809 1630746 1627297 1624796 1623139 1625348 1629037 1630496 1626036 1617460 1620295 1617596 1622868 1620117 1619169 1635028 1630902
949692 1628745 1630235 1631798 1628641 1635164 1639301 1635456 1641572 1643271 1640468 1634059 1631236 1640030 1637529 1631975 1633632
936486 1631381 1625932 1621806 1624087 1625630 1624796 1624431 1622931 1621285 1623410 1621847 1626307 1626401 1628151 1626932 1633674 1628662
922350 1630277 1636727 1636498 1628787 1633715 1634830 1630902 1630162 1628808 1628308 1628245 1629589 1631652 1624421 1622733 1626317 1621587
908113 1620378 1625140 1622420 1624296 1624494 1626151 1624608 1627370 1624671 1628495 1627234 1626838 1639894 1638759 1643885 1646720
894613 1650023 1646855 1638321 1635685 1634559 1634872 1632455 1630131 1630965 1635393 1627443 1630933 1630381 1630933 1629933 1629766 1635581
880169 1639311 1640853 1638738 1631965 1635320 1634351 1641937 1644813 1639842 1639311 1636758 1640916 1637425 1635070 1635758 1630683
866475 1631465 1632830 1630110 1636133 1627099 1627318 1629443 1627693 1627495 1625036 1633434 1626797 1621649 1623577 1631892 1632830
852683 1626557 1627536 1636904 1631861 1640051 1637144 1635372 1631798 1639040 1633778 1627318 1628401 1628214 1630485 1631381 1624734
838795 1624400 1626422 1624483 1622587 1621680 1623348 1629058 1629704 1628255 1624640 1625150 1630350 1628881 1634810 1639175 1639801
824809 1641697 1646459 1645271 1642249 1641072 1635424 1640322 1640082 1638123 1629131 1633455 1636633 1628151 1626338 1628172 1628026
810722 1630319 1632569 1634830 1635028 1635758 1640415 1632059 1634299 1640259 1645459 1643406 1635466 1631777 1634320 1638498 1634851
796536 1635039 1639269 1632976 1631194 1626078 1624786 1622962 1619086 1623931 1626057 1619159 1622941 1628745 1623619 1621931 1623504
782252 1626890 1628245 1638884 1638978 1636654 1634559 1629370 1632444 1627255 1630121 1628558 1629464 1625098 1623202 1622149 1617554
767864 1621003 1624296 1619169 1626036 1634664 1629620 1627495 1632080 1628849 1629297 1628224 1635716 1642510 1640728 1641708 1647761
753374 1647574 1639353 1637654 1638780 1641895 1642437 1640655 1635966 1632799 1637415 1644302 1652471 1648095 1646209 1650731 1657754
738779 1652450 1653680 1649804 1649908 1651325 1653763 1657046 1659380 1665559 1664006 1657410 1657244 1661964 1657098 1656941 1643885
724085 1649126 1647772 1647814 1644354 1635143 1641124 1638654 1639644 1643239 1641280 1647855 1645948 1647230 1644177 1642822 1642364
709280 1644771 1646563 1646271 1645188 1638780 1634685 1636664 1638446 1632038 1632684 1623754 1624942 1625286 1621920 1619273 1618627
694372 1622129 1623004 1626338 1621368 1627516 1632298 1629047 1629412 1623243 1632486 1631225 1629454 1636383 1637092 1629923 1625630
679358 1621149 1622962 1626713 1625046 1630777 1625546 1629537 1627224 1627130 1624421 1628620 1626526 1627839 1631434 1632705 1632319
664233 1636914 1636435 1637008 1638957 1633194 1638707 1640197 1638363 1638248 1631704 1629568 1623889 1625692 1620680 1619169 1618544
649003 1617794 1619524 1612084 1610990 1621243 1613709 1613615 1624536 1618825 1613626 1615595 1615064 1612438 1609145 1607614 1607655
633659 1607447 1601674 1593182 1595172 1590108 1592922 1593693 1588128 1583742 1581887 1583762 1584398 1584169 1587983 1577448 1582981
618205 1585190 1585013 1581001 1586253 1588660 1587920 1597715 1590785 1591067 1585576 1582887 1573447 1583502 1583648 1582252 1583346
602642 1580605 1579438 1582158 1579126 1578323 1580324 1577594 1582356 1590087 1594735 1593849 1592578 1587826 1592724 1585669 1587378
586966 1582835 1583564 1584961 1575051 1572321 1569060 1567862 1569185 1565465 1562412 1554983 1556994 1553232 1555889 1554993 1549950
571173 1543615 1546928 1545761 1540374 1545063 1541770 1547960 1540676 1532767 1524765 1516960 1514720 1520326 1516752 1513491 1505165
555268 1509052 1494349 1495954 1501081 1500091 1497923 1499945 1495360 1502456 1503977 1496673 1492661 1495746 1498340 1492026 1491432
539244 1491223 1487430 1487535 1488889 1485159 1488389 1482554 1486118 1480689 1484617 1478615 1478876 1483054 1479220 1484075 1485847
523107 1482200 1486159 1484179 1487691 1482304 1480522 1477198 1473885 1466184 1463017 1457630 1460610 1460547 1449335 1446157 1445344
506850 1437998 1439801 1438269 1431611 1431361 1430965 1430507 1430423 1426224 1422754 1417232 1413137 1407176 1405593 1397684 1398757 1390859
489446 1388931 1387108 1387316 1386076 1379887 1376625 1374458 1376000 1374896 1374250 1368883 1373739 1376427 1374896 1376198 1375437
472942 1373124 1375344 1372770 1364882 1364455 1374260 1364694 1364840 1363079 1356452 1359839 1359755 1361923 1357703 1351868 1351805 1348043
455275 1350586 1353128 1352628 1347470 1351399 1352982 1346001 1342260 1338134 1335508 1330788 1323921 1320962 1319066 1314220 1315867
438520 1306187 1303509 1301560 1304228 1297809 1295142 1289484 1292714 1285389 1283617 1279876 1281335 1279658 1275583 1270728 1273239
421640 1268977 1265883 1261298 1259714 1259537 1261016 1260620 1257078 1260120 1259849 1256692 1249419 1254983 1254191 1251409 1255796 1255265
403571 1258172 1250753 1249138 1248575 1250992 1249753 1242073 1238249 1237092 1234842 1237259 1231090 1225849 1226329 1224161 1221660
386433 1220473 1220608 1219816 1216451 1212095 1204030 1203290 1200143 1199018 1193527 1194996 1191474 1184545 1182107 1180210 1170092
369170 1169863 1168623 1168988 1168696 1164653 1163413 1165049 1168613 1169874 1171916 1181179 1183013 1183649 1182919 1177126 1179033 1175719
350684 1171051 1163101 1156974 1155723 1152754 1156953 1153848 1147283 1144136 1137113 1134738 1137895 1138697 1136071 1130726 1131278
333155 1134977 1129913 1128850 1129455 1126068 1124276 1121890 1122661 1121838 1115430 1112491 1104895 1101436 1102644 1098685 1105479
315493 1112585 1113742 1116242 1117993 1114315 1099654 1090578 1089224 1085837 1083013 1077949 1071833 1072698 1067550 1066842 1060610
297701 1063580 1059839 1062715 1062111 1062632 1055692 1058058 1058297 1059860 1054859 1059110 1064747 1059339 1060725 1056995 1053619
279775 1051712 1050795 1051816 1046835 1047325 1045971 1043178 1044793 1041582 1039754 1039583 1037785 1038372 1037592 1035065 1034336 1037929
260581 1033798 1041445 1050274 1069509 1084326 1080773 1069269 1047700 1034418 1026712 1020141 1017474 1017746 1017413 1014864
243517 1018166 1019488 1028955 1031688 1035653 1039527 1049815 1060037 1059589 1044085 1021482 1004943 995133 989882 986797
226334 984916 986498 984510 983176 982378 982792 978945 978079 975415 974667 971432 968936 966393 970574 968393 972016 973675
206711 979134 986903 988367 985760 978941 975316 972057 965396 959475 960429 955334 953349 951861 951125 946183 943648
188099 937101 936559 934828 935560 934580 927975 922896 918475 912522 909427 906663 906932 900862 899791 901129 902666 900539
168169 902741 919372 953146 1020009 1121650 1223234 1265362 1213752 1108219 999344 936607 918591
154005 929498 960295 996297 1016902 1013559 982030 945020 925135 931988 935921 931467 905083 876886 850628
137377 834417 824621 820383 817171 817682 819884 825118 827415 824057 817597 809650 799182 789005 784541 784205 786556
118238 788122 788233 782457 770509 764834 763832 755016 752624 752090 750732 756389 762558 761097 753992 748897 739743
98952 736716 739210 742744 749140 768575 802372 839953 862373 858808 826156 797531 789099 793067 796502
81957 790702 772347 744941 723272 701398 687618 678672 671339 666377 665559 670628 679263 679233
66073F87478  $$checkpoint
##END=
##END=   $$end of all blocks