##TITLE= Raman spectrum of Molybdenite � http://rdrs.uaic.ro
##MINERAL= Molybdenite
##CHEMISTRY= MoS2
##JCAMP-DX= 5.01
##DATA TYPE= RAMAN SPECTRUM
##DATA CLASS= XYDATA
##ORIGIN= Department of Geology, UAIC, Romania
##OWNER= http://rdrs.uaic.ro � stud. Apopei Andrei Ionut
##LONGDATE= 2010/06/01 14:08:50.0107 +0300 $$ export date from JSpecView
##SPECTROGRAPHDATASYSTEM= HE 532 (Horiba Jobin-Yvon)
##XUNITS= Raman shift (1/cm)
##YUNITS= Intensity (cnt)
##XFACTOR= 3.188909E-3
##YFACTOR= 1.48355148E-4
##FIRSTX= 3399.61
##FIRSTY= 1.51679348
##LASTX= 210.701
##NPOINTS= 1024
##XYDATA= (X++(Y..Y))
1066073A0224k107m176r39K119m448P694l234O78K161k695l506J216k157M632n36b261
1052896b389K391N673j432l095K525R97k646j252L605j297N133J491o828k286k062C571
1039622e730L154P652k081N61M699o52j238J12j327o768P936n780K315k946N732C817
1026251D288l082O632o904j868j688L843L709k363j373l944N266l637L197K299H27
1013575E374q50l772K882j839k469k469R223l279L062k289o471N220Mm1q181J0211A082
999213B345j571j705J667j77O254m179l190k290R758q048K699j978O072r127N082g25
985544B649M228q8j34J396l461o068P736L689n304J306k786O066n206J585N6m216A0272
970959C538o555O531l856J764J0218k913O85n880P295m397m397j428Q19l632N001E141
$$ y = [10224, 8117, 3941, 3002, 5121, 673, 8367, 5133, 5811, 7972, 5277, 1771, 2987, 830, 5462, 4926, -2261, -2389, 2, 5675, 4243, 1148, 3673, 4670, 2024, 772, 4377, 3080, 8213, 9704, 2876, 590, -1472, 3571, -5730, -2576, 5076, 2995, 3556, 8255, 7603, 6365, 6477, 5150, -1618, 6318, 538, 2853, -93, 5639, 3817, 4288, 1206, 7838, 934, -934, -2622, 1221, 4930, 2567, 1194, -2750, 2516, -1121, 2076, 4375, 827, 5374, 4524, 752, 3634, 1795, -674, -3143, 6080, 2801, 5863, 3574, -2897, 2323, 2327, 2286, -5895, 4316, 1082, 2345, 774, -931, 736, 559, 6813, 2634, -556, -2846, 6912, -1136, 1563, -415, 5657, -3470, 1612, -725, 2649, 6877, 6789, 6655, 8051, 4590, -1478, 6258, 9947, 4643, 5949, 3163, 9229, 4023, 5608, 5664, 1448, 10272, 3538, -3017, 3514, -342, 1422, 11640, 8727, 9412, 3532, 10827, 6430, 2033, 605, 1424, -2208, 2793, 5141]
957083F680m712J0J133m532O260l138J399L622j774j0498J3874o5j11k584l754E611
943100i30P398J912l529O319k675r67j12j0499M744r22K046O8l665p083O362J102c962
928186D22m700M518R21k857r23l981P800o09j238o113Q74k94J369J324J190O360c111
913149h397J1892l307k003M877m161O001m74l306j14L483L124J055m206j778j372a138
898843b781K809N013J505J236p893L979O901q747M00l872L367L502j894M941p740I00
884428E706k748M221L54o706J883n01M536q145J1865n672n042J118P503n761q61B688
869906F639o842R38P054n088M43m503k255R256j86l020j715j266J657K848m616D712
855277F661l986l88L029j198p93K174k681L478j467n425N11q38J590K490N368D449
$$ y = [6680, 1968, 1978, 3111, -1421, 4839, 1701, 3100, 6722, 4948, -5550, 8324, 8259, 8148, 5564, 1810, 5611, -930, 6468, 8380, 4851, 11170, 8495, 7528, 7416, -3083, 1661, 739, 2785, 2853, -812, -7895, -1533, -431, -3962, 422, -4278, 240, 1161, -1696, -2619, -6600, 1200, 591, -647, -6760, -5886, -6180, -4811, -3487, -2297, 4063, -3111, -8397, 3495, 188, -1815, 3062, -1099, 4902, 4428, 1122, 1008, 4491, 7615, 8670, 4464, 2686, 1314, -1138, -2781, 28, 5041, 6546, 7782, -111, 3868, 10769, 2022, 2422, -1450, 1917, 5419, 3525, 8466, 726, 900, 5706, 2958, 7179, 7533, 827, 2710, 2209, 6745, -1400, 10465, 4793, -249, 869, 8372, 2611, 1750, 2688, 6639, -203, 735, 7789, 2701, 3144, -1359, -3614, 5642, 5456, 2436, 721, -545, 1112, 3960, -656, 4712, 6661, 2675, 2287, 5316, 4118, 3325, 5499, 2818, 6296, 4829, -596, -85, -923, 667, 3157, 8525, 4449]
840535C207j153o639J1664o504J905J591L389P37n605N503l625J096j153M514b747
826562B801M244q842R011k457l040l266O718k411O672n829J367k08l715N009O47B402
811607B284K87K221n22O583p537k366m794N502k063O212m580J1338r437l051L694F385
796536G696o109K749n434N01L244j837P022J221j298l98J041p997Pl771l995Q955A379
780458B62L784m220R51J671o108O752o424Q102l995l042N842m501M762l736N526D138
765155E168J76K693m456K334K694p109N301o075M852k028p694N482j984K604l20a514
749736A944l242P864p469J929K333j848P59K064l153K379L997n581N481m811K014f56
734198A673j717L124O186N781O546j4679m427N65o95k326Q87l71J293N430q464C562
$$ y = [3207, 2054, -4585, 7079, 575, 2480, 4071, 7460, 8197, 2592, 8095, 4470, 5566, 4413, 8927, -2747, 2801, 7045, -1797, 7214, 4757, 1717, -1549, 5169, 2758, 9430, 3601, 4968, 4760, 1045, 6054, 6701, 2402, 2284, 2571, 4792, 4270, 10853, 3316, 950, -3844, 1658, -405, 5807, 1227, 12565, 3128, 77, 3771, 6385, 7696, 1587, 4336, -1098, -597, 2647, 810, 7832, 9053, 7755, 7357, 8398, 401, 408, -3363, -7358, 1597, 1379, 262, 4046, -174, 777, 2448, -3660, 3092, -3332, 4770, 775, -2267, 3575, -926, 3836, 100, 5626, 4138, 5168, 5344, 8037, 3581, 5915, 8609, 1500, 6801, 726, 5578, 3550, -4144, 1338, -646, 1958, 1638, -1514, 1944, -1298, 6566, -903, 1026, 3359, 1511, 2270, 4334, 1181, 3560, 7557, 1976, 7457, 2646, 4660, -656, 1673, -44, 3080, 9266, 15047, 21593, 6914, 2487, 3052, 2357, 31, 918, 547, 1840, 7270, -1194, 3562]
718544@J3428q246L175k265l77P222n188k086N23N064p302O099K051k805o402H719
702770G128j860k42Q931k445o627L086j771o46K591l704L220p661J02J811K441A938
686878E413l721N07K530L699j0106Q21k057Q66N722L563o779J46q43J090j429b006
670863a501j383O305j653J809P28j609K754n970O531n250K574o060M238j159p8C704
654725a007m800L609L518K37K844l226k697K721n687N059L082l619L487k270k133B424
638466D248k179Q254n956m426R288j3015O55N962k537J465N512l391K365M208I086
623047G090j243Q62j701j791O482j3618J1025o513K750L469m87O81p862J3137E902
607518C121J670J491l186L109L424l861o68j74m311L469K075l232J400n930J433D546
$$ y = [0, 13428, 5182, 8357, 6092, 5715, 12937, 7749, 5663, 6186, 11250, 3948, 10047, 12098, 9293, 2891, 8719, 7128, 5268, 5026, 13957, 11512, 4885, 7971, 6200, 5554, 8145, 4441, 7661, 0, 102, 1913, 4354, 1938, 5413, 1692, 2199, 4729, 8428, -1678, -857, -2914, -2048, 3674, 7237, 458, 604, -239, 851, -578, -2006, -1501, -2884, 3421, 1768, 3577, 4305, 2696, 5450, -520, 6011, 761, 3335, -2725, 1513, 354, 276, 3704, -1007, -5807, -2198, 1320, 1557, 4401, 1175, -1522, 1199, -4488, 571, 3653, 34, 3521, 1251, -882, 2424, 4248, 2069, 10323, 4367, -59, 9229, -3786, -3131, 2831, 294, 1759, 7271, 3880, 6245, 10453, 9086, 7090, 5847, 6709, 5008, 3217, 9699, -3919, 7106, 593, 3343, 6812, 6325, 7006, -856, 12281, 5902, 3121, 4791, 6282, 3096, 6205, 9629, 5768, 5100, 4926, 615, 4084, 6159, 2927, 4327, -1603, -170, 4546]
590895E258k796k707K61j223N29k934j540M469n400L729k072Q07o32J303j710h82
574143b051L732P20o29m4l101m179J675K113p194R802J349m047O521p915J0208A024
557263A650k688M238q803N901J225p184P431L26j610J682L481l87k725J457m388I73
540251C825m76O314l354m613M021k96K357K627j914m163K178j16O315k364K538A1549
523107H646o144o14n24M466n021O534q41L116l47j967n789l41J22M711K62o073E454
504809e55K119J263m90J812j641k629J599p293M267L817l828J704K603p379L638H2
487389B282L099J031r222q12J616R73N33p70l558P369J658l288k76M45k074l962C0
468797d921J614J164L278K334n221L639J569o344Q899p243N797k972q58k612N123a614
$$ y = [5258, 2462, -245, 16, -1207, -678, -3612, -5152, -683, -6083, -2354, -4426, -3619, -4251, -2948, -4658, -882, -2051, 1681, 2401, 1772, 1728, -1373, -5552, -3877, -1764, -8958, 844, 2193, -1854, 4667, -3248, 6960, 1024, 1650, -1038, 3200, -5603, 298, 1523, -5661, 1770, 2096, 486, 2168, 5649, 5262, 2537, 3994, -394, 973, 3825, 3349, 9663, 6309, 1696, 5717, 5421, 7778, 10405, 8491, 4328, 6506, 6390, 12705, 10341, 12879, 11549, 8646, 2502, 1888, 1364, 5830, 809, 7343, 6502, 9618, 9271, 7304, 1515, 1174, 1296, 6007, 6269, 196, 5454, -555, 1564, 2827, 2337, 4149, 2508, -121, 1478, -5815, -1548, 2269, -1559, 145, 2748, -4631, -993, 82, 2282, 5381, 6412, -2810, -3622, -2006, -1033, -500, -1270, -4828, 2541, 4199, 911, 635, 1080, -994, -4956, 30, -4921, -3307, -2143, 1135, 3469, -1752, 1887, 3456, -2888, 6011, -1232, 4565, 1593, 735, -1877, 3246, -1614]
451098a572L819L505m410J391K426q007N888J33k565r92j576Q227l779Q6L456E709
433258F737Q03p201N345k839j804Q268n851R84L007j939l333m10M582k793J299F470
415280E431N841m906p109N572P190k027n175L863j263k746k297J975K22J301n669G709
397161G482J166k476N034q456J706R67M316K69r0j665n891N485K338q10k293n307E193
377819A3512j0748%L283L15N576o745M137j213m497K159M06j664P106j79q183E469
359402G718k562Q11o070M003J441K069n214P645o114K745l911k561R059k768j194A1053
340841I004j824k949k049J952j600P38k589K896L076J8n469O808m659l716Q786E26
322132A397L164l536k996Q323q045M320p61j705K971m808M08j975J937P692j121c08
$$ y = [-1572, 2247, 5752, 1342, 2733, 5159, -2848, 3040, 3173, 608, -384, -1960, 6267, 2488, 2574, 6030, 5709, 6737, 7540, 339, 5684, 2845, 1041, 9309, 3458, 4442, 7449, 5510, 2177, 1767, 6349, 3556, 4855, 6470, 5431, 11272, 6366, -743, 4829, 12019, 9992, 4817, 8680, 7417, 4671, 2374, 4349, 4571, 5872, 203, 7709, 7482, 8648, 6172, 11206, 2750, 4456, 5423, 9739, 10008, 9918, 8253, 2362, 7847, 10185, 9375, 7082, 1775, 5193, 13512, 2764, 2764, 6047, 6362, 11938, 5193, 9330, 8117, 3620, 5779, 6185, 4521, 11627, 11448, 3265, 5469, 7718, 5156, 5967, -103, 3900, 5341, 7410, 2196, 9841, 3727, 6472, 2561, 0, 9059, 6291, 5097, 11053, 9004, 7180, 4231, 2182, 4134, 2534, 3272, 683, 3579, 6655, 6673, 1204, 8012, 3353, -363, 8423, 526, 1397, 4561, 1025, -1971, 6352, -1693, 2627, 1866, 161, 3132, -1676, -1268, -3243, -1306, 6386, 5265, -308]
303276a475L18J261K521m045N399n169j700L174k268M118P46M567K409p530N377C861
284269D875L083l663K498j11K587J733n956k809P533K407N689l259n688O498m428F245
265111D334Q117J146J461m115R870J911Q835j238o768N282k812n060j913L528B1835
246940B2754R284K898R19p759M651M517k6J1396O225n66l578k6o637p851P348B9178
227483B3800M200r156m569K626J231L255q37N57p089p447K849k592M918q348K939I680
207870D300L613K40M65M737M737P614M332k459P524M331K442o236O984n563N140D4238
188099E7427Q737L925k460l225r77J137l001k821k281p992k147q622L429j4918B1950
169347A7150j609N272K529j069n385j1412n476Q379m347m032L372L596l239J526C409
$$ y = [-1475, -1157, 104, 2625, -1420, 3979, -1190, -2890, 284, -1984, 2134, 2880, 7447, 9856, 2326, 7703, 3861, 4875, 7958, 4295, 6793, 6682, 9269, 11002, 5046, 2237, 9770, 12177, 17866, 14607, 8919, 15417, 10989, 6245, 4334, 12451, 13597, 15058, 10943, 20813, 22724, 31559, 30321, 23553, 28835, 26023, 20963, 19050, 22578, 21835, 22754, 32038, 34936, 35855, 28096, 32747, 37264, 37238, 48634, 54859, 54293, 50715, 50689, 44052, 36201, 43549, 29178, 23800, 28000, 18844, 14275, 16901, 18132, 21387, 20550, 21107, 14018, 6571, 9420, 6828, 11746, 3398, 6337, 9680, 4300, 7913, 8153, 8618, 13355, 18092, 25706, 30038, 27579, 35103, 39434, 41876, 35640, 42624, 37061, 42201, 44238, 57427, 66164, 70089, 67629, 64404, 63427, 64564, 61563, 58742, 56461, 48469, 46322, 37700, 41129, 26211, 21950, 17150, 15541, 20813, 23342, 22273, 16888, 5476, 0, 8379, 4032, 0, 3372, 6968, 3729, 5255, 3409]
150451A4603J4117r3K9045J5240L3271J9556J0517O155j2597j8353j1654j1608G9782
133799H0854J4875J03956K54509L20158K16690l7020k68016l04395j33296J00851D91477
119438E87290p0882j79569j55599r9708l6753j2380r189q199n636N020q830n12@
102580D204l173P440J592k906L524J8227J4359J5438J5167K214M598j6943j2403D0913
84392D3079j8162j2406R4J127r306K788j742j117l772N490m089Q185o613D903
$$ y = [14603, 28720, 28627, 57672, 72912, 106183, 125739, 136256, 142411, 129814, 111461, 99807, 88199, 79782, 80854, 95729, 199685, 454194, 774352, 991042, 954022, 686006, 381611, 248315, 349166, 491477, 587290, 516408, 336839, 181240, 81532, 44779, 32399, 23210, 15011, 9375, 14395, 5565, 5053, 0, 4204, 1031, 8471, 10063, 7157, 10681, 28908, 43267, 58705, 73872, 76086, 80684, 63741, 51338, 40913, 43079, 24917, 12511, 12605, 13732, 4426, 7214, 5472, 4355, 583, 6073, 1984, 10169, 3556, 4903]
66073B604  $$checkpoint
##END=