##TITLE= Raman spectrum of Natrite � http://rdrs.uaic.ro
##MINERAL= Natrite
##CHEMISTRY= Na2CO3
##JCAMP-DX= 5.01
##DATA TYPE= RAMAN SPECTRUM
##DATA CLASS= XYDATA
##ORIGIN= Department of Geology, UAIC, Romania
##OWNER= http://rdrs.uaic.ro � stud. Apopei Andrei Ionut
##LONGDATE= 2009/10/18 22:54:12.0697 +0300 $$ export date from JSpecView
##XUNITS= Raman shift (1/cm)
##YUNITS= Intensity (cnt)
##XFACTOR= 3.188736E-3
##YFACTOR= 7.33105682E-4
##FIRSTX= 3399.97
##FIRSTY= 7.35057714
##LASTX= 211.234
##NPOINTS= 1024
##XYDATA= (X++(Y..Y))
$$ plain form
1066244 10027 12553 13311 13202 14639 14450 15519 14811 13819 13115 10284 9238 6335 6911 7261 7089 7705 6516 6325
1051508 4835 4432 5095 4389 5405 5077 5191 4910 5229 5002 3204 1625 21 1466 3515 3083 2173 3577 2392
1036652 3484 4961 5271 5536 4250 1592 3132 3196 3977 4118 3845 4194 4965 4459 2702 1733 1932 2227 4271 3349
1020884 2106 2558 1502 1689 644 2340 3958 3972 4127 4301 2533 2716 1850 916 -132 412 3085 2615 2156
1005778 2783 1940 1312 426 389 -87 1767 212 3380 5203 4684 2683 4022 1699 -8 1136 2803 4707
991352 4847 3292 1803 3108 4207 6433 5197 5321 4589 6199 5928 6640 5406 5847 6898 6569 5965 5938
976813 7726 6205 6888 8573 7525 8732 8129 7834 8102 8068 9320 8314 8168 7344 6913 7930 7828 8561 9472
961343 9364 9545 9607 11465 11138 12738 13237 12656 11113 11977 10693 10777 11698 11510 11457 12381 12863 12676 10179 10125
$$ packed form
1066244A0027K526P58j09J437j89J069p08r92p04k831j046k903N76L50j72O16j189F325
1051508D835m03O63p06J016l28J14k81L19k27j798j579j604J445K049m32r10J404B392
1036652C484J477L10K65j286k658J540O4P81J41k73L49P71n06j757r69J99K95K044C349
1020884B106M52j056J87j045J696J618J4J55J74j768J83q66r34j048N44K673m70B156
1005778B783q43o28q86l7m76J854j555L168J823n19k001J339k323j707J144J667D707
991352D847j555j489J305J099K226j236J24p32J610k71P12j234M41J051l29o04E938
976813G726j521O83J685j048J207o03k95K68l4J252j006j46q24m31J017j02P33I472
961343I364J81O2J858l27J600M99n81j543Q64j284Q4R21j88n3R24M82j87k497A0125
$$ plain form
944920 11005 12281 13875 14968 14081 13683 15079 14548 15317 15818 14733 14144 14256 13989 14918 13822 11093 11159
930014 11566 11845 13721 14111 14058 15519 14192 14551 15159 15244 15736 15154 13881 10513 10716 10296 10673 11765 11234
914155 11766 13087 13502 12739 12590 11715 10748 12208 12878 14333 13453 12917 11935 10893 10601 7969 5848 4215 3845
898165 8061 12580 16196 15444 14377 13824 13573 15277 14616 14903 14370 14473 15060 16194 14451 13870 12757 13064 11892
882042 12528 11717 12706 12536 13453 15680 15607 14907 13098 13402 12808 12533 13393 13972 14243 14043 13310 13242 14681 14945
864923 14577 15093 13466 10159 11106 10620 14162 13691 14354 15030 15517 14709 14146 12976 11692 13132 13469 13059 11701
848521 11739 12063 12661 14455 14914 14554 14748 15113 14527 12982 13063 11924 11708 11728 12152 12165 14193 14229 13390 13592 11815
830232 7728 8849 9420 11220 10144 11813 10645 11789 12416 11314 11498 12269 12301 10834 9363 8543 10623 9358
$$ packed form
944920A1005J276J594J093q87l98J396n31P69N01j085n89J12k67R29j096k729A1159
930014A1566K79J876L90n3J461j327L59O08Q5M92n82j273l368K03m20L77J092A1234
914155A1766J321M15p63j49q75r67J460O70J455q80n36r82j042k92k632k121j633C845
898165H061M519L616p52j067n53k51J704o61K87n33J03N87J134j743n81j113L07A1892
882042A2528q11R89j70R17K227p3p00j809L04n94k75Q60N79K71k00p33o8J439A4945
864923A4577N16j627l307R47m86L542m71O63O76M87q08n63j170j284J440L37m10A1701
848521A1739L24N98J794M59l60J94L65n86j545Q1j139k16K0M24J3K028L6q39K02A1815
830232G728J121N71J800j076J669j168J144O27j102J84P71L2j467j471q20K080I358
$$ plain form
814420 9425 10105 6899 6398 6242 7780 8067 6981 5568 3739 2132 3209 5308 7981 8656 7381 6429 7097
798483 8141 8257 9028 8223 8044 8153 6584 6675 7293 7212 6375 4975 5121 5084 4237 -40 1061 2778 5568 6211
780626 7528 6046 5558 5575 5489 5217 6491 4285 4177 1993 2076 3802 4754 6502 5950 6894 8379 8274 7088 7433
762609 6137 6423 5906 4782 3433 4139 2067 1230 36 3037 4795 3762 4049 5399 4283 4940 5863 4841
746258 3907 3457 3447 4093 4605 4828 5555 5748 4739 5810 3943 2361 2627 3005 4206 4674 6630 8066 6853
728856 6022 5258 6230 5572 4487 4858 3069 4756 4555 4500 5859 3961 4731 4163 2497 2513 3850 3530 4426
711304 3342 3920 4220 4292 4359 3700 2972 3446 3008 2623 3257 3366 3198 3419 3609 4651 4265 2471 3817 2487 1943
691732 2026 2694 1949 2303 135 2123 -134 733 1416 1911 647 2426 3260 2780 2274 5132 3677 1764 1380
$$ packed form
814420I425O80l206n01j56J538K87j086j413j829j607J077K099K673O75j275r52G097
798483H141J16P71q05j79J09j569R1O18q1q37j400J46l7q47m277J101J717K790F211
780626G528j482m88J7q6k72J274k206j08k184Q3J726R52J748n52R44J485j05j186G433
762609F137K86n17j124j349P06k072q37j194L001J758j033K87J350j116O57R23D841
746258C907m50j0O46N12K23P27J93j009J071j867j582K66L78J201M68J956J436F853
728856F022p64R72o58j085L71j789J687k01n5J359j898P70n68j666J6J337l20D426
711304C342N78L00P2O7o59p28M74m38l85O34J09j68K21J90J042l86j794J346j330A943
691732B026O68p45L54k168J988k257Q67O83M95j264J779Q34m80n06K858j455j913A380
$$ plain form
673866 1418 3491 3934 2461 2414 4147 4587 4262 3477 3235 4192 5463 6959 5961 5750 4204 3258 4842 3714
655846 1161 1237 1437 2923 5238 6258 5325 4197 917 373 1344 2937 6264 5673 5131 4261 1780 2487 2063
637673 4268 5901 5493 5720 5390 4836 4502 2248 2796 5402 5114 5139 5079 4530 2408 431 593 1382 524 2622
618374 2860 2530 1082 3303 5561 7709 7234 8062 6037 6336 6676 6397 5208 7394 5724 9062 9182 8135
600856 5497 6678 7590 7572 6941 6968 8325 9582 7718 7353 7781 10730 10238 10768 8464 10572 11323 10680 11163
582209 11381 9818 8894 8314 8071 5796 2629 2287 4710 8598 6780 1439 -3 929 6963 9755 11100
565390 12219 12993 13270 12435 13536 15755 17734 18131 20282 24737 27605 29120 26929 27185 25828 22263 20457
548440 17852 18680 18601 16958 17083 17386 16906 13699 16169 15430 17428 16659 17359 18191 18807 19978 20567 19202 19710
$$ packed form
673866A418K073M43j473m7J733M40l25p85k42R57J271J496r98k11j546r46J584C714
655846A161P6K00J486K315J020r33j128l280n44R71J593L327n91n42q70k481P07B063
637673D268J633m08K27l30n54l34k254N48K606k88K5o0n49k122j977J62P89q58B622
618374B860l30j448K221K258K148m75Q28k025K99L40k79j189K186j670L338J20H135
600856E497J181R12j8o31K7J357J257j864l65M28K949m92N30k304K108P51o43A1163
582209A1381j563r24n80k43k275l167l42K423L888j818n341j442R32O034K792A1100
565390A2219P74K77q35J101K219J979L97K151M455K868J515k191K56j357l565B0457
548440A7852Q28p9j643J25L03m80l207K470p39J998p69P00Q32O16J171N89j365A9710
$$ plain form
529341 20917 20227 20446 20940 21913 22061 21226 20411 22090 21269 21046 21349 20772 22190 21951 20894 20889 20374 19646 20154
509058 20176 19286 20155 20800 19751 20211 18281 18780 19490 19459 18875 19357 18088 18804 18187 18817 18509 19333 19093 19860
488585 21499 21386 20659 20554 22415 24174 24766 25457 23432 21437 20472 19316 20040 17532 15950 16148 16050 15193 16887
468966 15915 17626 18536 18192 18309 18728 17629 16976 18719 19800 19639 19468 20070 22139 21438 21578 21597 26263 36810
449175 43848 45665 42863 36154 31587 23687 20295 21242 21867 23043 21534 23497 21647 19777 19550 17554 17473
431318 17186 17104 15733 14536 15709 17124 16418 14825 14118 13714 14272 17050 15934 16123 16034 16004 15362 16411 16403
411197 14712 14112 13876 14992 14981 13101 13125 11373 10805 10106 12360 13492 12641 14164 15233 13329 12606 12677 13653
390898 13721 14786 15043 14797 13613 14084 14208 13937 13417 11680 10805 12524 12606 11540 11652 11508 12154 12035 13052
$$ packed form
529341B0917o90K19M94R73J48q35q15J679q21k23L03n77J418k39j057nn15p28B0154
509058B0176q90Q69O45j049M60j930M99P10l1n84M82j269P16o17O30l08Q24k40A9860
488585B1499j13p27j05J861J759N92O91k025j995r65j156P24k508j582J98r8q57A6887
468966A5915J711R10l44J17M19j099o53J743J081j61j71O02K069p01J40J9M666C6810
449175D3848J817k802o709m567p900l392R47O25J176j509J963j850j870k27j996A7473
431318A7186q2j371j197J173J415p06j593p07m04N58K778j116J89q9l0o42J049A6403
411197A4712o00k36J116j1j880K4j752n68o99K254J132q51J523J069j904p23P1A3653
390898A3721J065K57k46j184M71J24k71n20j737q75J719Q2j066J12j44O46j19A3052
$$ plain form
370420 12995 12732 13350 12845 14700 12830 13367 11656 11950 11448 10554 11124 10293 9345 10554 10676 8553 9006 10717
349762 11409 10874 12356 14572 17648 21301 35452 126812 434093 848479 999866 751919 416458 258753
334424 186201 116251 77030 54431 37151 27761 21715 17820 16610 15994 14023 12916 10948 9231 8335
317878 7529 8002 8582 5994 4391 4222 3451 1529 2361 5236 6509 5620 6369 6198 5775 5371 4831 3531 1822
296754 530 2 2312 2347 3031 4350 3730 3315 3695 3506 3031 1807 948 1621 2603 4283 5000 5122 5747 3876
274315 5379 4743 4626 3001 2788 1447 1536 2127 1728 2606 1889 2158 3474 2507 3163 3894 2887 3705 3106 4292
251665 3507 4460 3574 4726 3646 4332 4863 5992 5511 5205 4049 3516 4533 4130 4941 3583 4348 4188 4061
229950 3722 4825 5931 5959 8831 12705 24266 39295 53338 52220 37289 23930 15414 13584 10958 9516
$$ packed form
370420A2995k63O18n05J855j870N37j711K94n02q94N70q31r48J209J22k123M53A0717
349762A1409n35J482K216L076L653J4151R1360L07281M14386J51387k47947l35461B58753
334424A86201o9950l9221k2599j7280r390o046l895j210o16j971j107j968j717H335
317878G529M73N80k588j603j69p71j922Q32K875J273q89P49j71m23m04n40j300A822
296754E30n28K310L5O84J319o20m15L80j89m75j224q59O73R82J680P17J22O25C876
274315E379o36j17j625k13j341Q9N91l99Q78p17K69J316r67O56P31j007Q18n99D292
251665C507R53q86J152j080O86N31J129m81l06j156n33J017m03Q11j358P65j60D061
229950C722J103J106K8K872L874J1561J5029J4043j118j4931j3359q516j830k626I516
$$ plain form
211512 9819 9419 7986 8403 8342 8007 10020 9765 9036 8175 7001 7295 6933 6637 5740 4570 5756 4752 6640
189436 4739 4934 5074 4312 4295 5495 5538 3636 3975 3261 5084 5334 3726 3232 2704 1042 2770 896 1252
167162 2878 2303 2537 1688 1186 1065 -25 893 600 24 484 2079 4831 5502 6356 4996 2665 1316 2116
144686 2568 4978 7816 6467 5705 4567 3004 2001 497 3006 2014 2563 3644 3354 4536 3023 2408
124404 2383 2910 3434 3907 4328 5388 7292 5542 6192 4968 7012 3845 5070 5829 4183 2218 0 1614
102750 1720 3656 6247 7740 8570 12005 22724 30353 31814 33639 35172 36529 31652 25943 21544 19946
83345 19807 15314 15621 16421 24780 26169 30324 28405 33162 37153 42849 52434 59815 63379
$$ packed form
211512I819m00j433M17o1l35K013k55p29q61j174K94l62k96q97j170J186j004F640
189436D739J95J40p62j7J200M3j902L39p14J823K50j608m94n28j662J728j874A252
167162B878n75K34q49n02j21j090R18k93n76M60J595K752O71Q54j360k331j349B116
144686B568K410K838j349p62j138j563j003j504K509r92N49J081k90J182j513B408
124404B383N27N24M73M21J060J904j750O50j224K044l167J225P59j646j965k218A614
102750A720J936K591J493Q30L435J0719P629J461J825J533J357m877n709m399A9946
83345A9807m493L07Q00Q359J389M155j919M757L991N696R585P381F3379
66244G1664  $$checkpoint
##END=