##TITLE= Raman spectrum of Nephrite (no. 2098) � http://rdrs.uaic.ro
##MINERAL= Nephrite
##CHEMISTRY= Ca2(Mg,Fe++)5Si8O22(OH)2
##JCAMP-DX= 5.01
##DATA TYPE= RAMAN SPECTRUM
##DATA CLASS= XYDATA
##ORIGIN= Department of Geology, UAIC, Romania
##OWNER= http://rdrs.uaic.ro � stud. Apopei Andrei Ionut
##LONGDATE= 2010/10/09 14:13:35.0981 +0200 $$ export date from JSpecView
##SPECTROGRAPHDATASYSTEM= HE 532 (Horiba Jobin-Yvon)
##XUNITS= Raman shift (1/cm)
##YUNITS= Intensity (cnt)
##XFACTOR= 3.188909E-3
##YFACTOR= 2.08889728E-4
##FIRSTX= 3399.61
##FIRSTY= -1.09274154
##LASTX= 210.701
##NPOINTS= 1024
##XYDATA= (X++(Y..Y))
$$ plain form
1066073 -5231 -3934 6233 4175 4480 -3730 -2561 8180 -2596 -4857 3075 53 3136 2243 -3506 -612
1053674 -846 1259 491 2062 -4019 1744 -857 -663 -2400 -19 75 3296 -2024 -4624 -6918 -2775 5112 -499
1039622 1058 -2976 -2919 367 -1151 2669 3719 2608 6352 -1216 1898 -636 -2459 2174 8459 180 -5482
1026251 2990 -6333 2316 950 -3263 -257 3308 314 -366 -2089 383 1761 114 -2727 -2300 124 -5459
1012782 3651 -508 3569 961 2649 -1535 -330 -4386 -1147 1406 -515 4707 3122 368 792 5460 6621
999213 1935 2663 -269 -1778 3753 1558 -155 -6087 -3275 655 -2456 -2542 -570 -2309 -1125 949 -1070
985544 1588 -6226 -1408 81 6170 -958 733 10 -4628 -6496 -2771 -5249 5542 -3494 -1600 -2502
972587 -2032 -9340 2446 -6314 -4271 85 -2040 -3226 1410 -742 -554 14 175 1201 1490 889 -5991
$$ packed form
1066073e231J297J0167k058L05q210J169J0741j0776k261P932l022L083q93n749f12
1053674h46K105p68J571o081N763k601J94j737K381R4L221n320k600k294M143P887d99
1039622A058m034N7L286j518L820J050j111L744p568L114k534j823M633O285q279e482
1026251B990r323Q649j366m213L006L565k994o80j723K472J378j647k841M27K424e459
1012782C651m159M077k608J688m184J205m056L239K553j921N222j585k754M24M668F621
999213A935P28k932j509N531k195j713n932K812L930l111q6J972j739J184K074a070
985544A588p814M818J489O089p128J691p23m638j868L725k478J0791r036J894b502
972587b032p308J1786q760K043M356k125j186M636k152J88N68J61J026K89o01e991
$$ plain form
958720 -187 432 -2635 3805 -3075 -5075 -4685 712 -4007 882 1856 -856 449 4041 -730 -8474 1650
944753 1735 446 -1173 1428 -582 -6964 5006 3962 2918 8432 168 -3011 10509 2576 -1468 969
931510 1220 -1986 1367 4693 1741 2119 -1876 637 6505 502 -722 367 -3755 638 -3433 -3819 548
917339 3593 -6198 -1856 502 -393 1941 2977 2006 2203 2833 -605 -5898 4340 -4665 590 2643 4263
903061 2248 2139 1827 2303 4986 2061 4271 -4628 5842 8814 2329 3852 6645 2930 3995 2415 1319
888680 4238 2074 5781 286 3256 -1502 1518 -2808 2805 -2259 -2696 857 6062 2142 2034 4214 6623
874189 -3399 -6328 -4963 -1589 -7188 4320 -3186 2421 1732 3076 4599 5079 856 14 -1692 -527 -2818
859589 -3610 -3156 -3795 -5121 -3600 -5130 3889 -2064 194 87 -1087 -991 -2013 397 3746 -1877 2108 221
$$ packed form
958720a87O19l067O440o880k000L90N397m719M889R74k712J305L592m771p744A650
944753A735j289j619K601k010o382J1970j044j044N514q264l179J3520p933m044I69
931510A220l206L353L326k952L78l995K513N868o003j224J089m122M393m071l86E48
917339C593r791M342K358q95K334J036r71J97O30l438n293J0238r005N255K053D263
903061B248j09l12M76K683k925K210q899J0470K972o485J523K793l715J065j580A319
888680D238k164L707n495K970m758L020m326N613n064m37L553N205l920j08K180F623
874189c399k929J365L374n599J1508p506N607o89J344J523M80m223q42j706J165b818
859589c610M54o39j326J521j530R019n953K258j07j174R6j022K410L349n623L985B21
$$ plain form
844013 291 -3884 -1679 17 620 -2792 -1732 -112 1228 -2135 -1634 2654 -1218 4468 444 -3911 -1301
829190 -2555 690 -1175 1743 -117 3591 3689 4398 -1529 -4252 -4002 -2633 -680 -582 -5720 -514 3320 1181
813372 -2001 1376 2261 -2446 4107 4586 -3680 4678 860 -1788 1181 4709 3458 4139 -3060 -371 1734
798317 2008 9526 6318 5880 -658 530 -5373 1917 -3377 6175 6372 4764 2165 2845 7643 3544 -4216
783146 -2240 245 5528 -1616 3949 2092 463 4807 -2975 -1250 -4024 2733 -4339 -1853 -3181 -2424
768764 1306 4425 3376 -4003 1809 1653 -4394 1810 5166 6133 1559 -906 -8557 747 -5532 -3143 -271
753374 1126 -2662 -1698 -4470 -4803 -2035 -1579 -2753 3847 2669 -2043 1049 -3054 342 2263 2684 2927
737864 3347 2242 -7811 -579 -2651 2191 474 2061 7893 -2718 6105 210 -576 2120 -3064 -5528
$$ packed form
844013B91m175K205J696O03l412J060J620J340l363N01M288l872N686m024m355a301
829190b555L245j865K918j860L708R8P09n927k723K50J369J953R8n138N206L834A181
813372b001L377Q85m707O553M79q266Q358l818k648K969L528j251O81p199K689A734
798317B008P518l208m38o538J188n903P290n294R552J97j608k599O80M798m099d216
783146b240K485N283p144N565j857j629M344p782J725k774O757p072K486j328b424
768764A306L119j049p379N812j56o047O204L356R67m574k465p651R304o279K389b71
753374A126l788R64k772l33K768M56j174O600j178m712L092m103L396J921M21B927
737864C347j105j0053P232k072M842j717J587N832j0611Q823n895p86K696n184e528
$$ plain form
723163 1515 -1382 -33 2128 909 859 8867 2564 1064 531 361 1237 2901 3726 4728 4460 7674 416
706492 7722 -3680 3524 -1778 1233 -4323 -1441 959 3969 3572 1270 2576 4874 1757 -3426 3337
691566 4660 5119 -2480 4333 267 4131 2657 -4562 3342 2452 -1794 35 6795 -692 -3357 -1218 -1569
675585 -2811 -1105 957 -2395 2309 24 -1017 3179 8798 182 157 -3477 -1291 1378 6995 -1191 2011
659486 8847 3787 811 3859 -8548 -3390 -827 -601 697 3045 -5511 3548 -382 -1491 -642 -5258 5402
643261 2896 161 6958 -8156 -1436 -5696 4309 7509 6313 1278 -1774 6588 2164 2671 -3888 1628
627876 3584 10269 8414 0 5109 4879 1980 2792 680 3448 2326 1433 5420 1222 2489 1009 852
611410 9285 3915 935 4130 4326 1091 -4355 -6345 1679 2129 3188 -1931 6219 694 5005 -4817 2341
$$ packed form
723163A515k897J349K161j219n0Q008o303j500n33j70Q76J664Q25J002k68L214D16
706492G722j1402P204n302L011n556K882K400L010l97k302J306K298l117n183C337
691566D660M59p599O813m066L864j474p219P904q90m246J829O760p487k665K139a569
675585b811J706K062l352M704k285j041M196N619q616k5l634K186K669N617q186B011
659486H847n060k976L048j2407N158K563K26J298K348q556R059l930j109Q49m616E402
643261B896k735O797j5114O720m260J0005L200j196n035l052Q362m424N07o559A628
627876C584O685j855q414N109k30k899Q12k112K768j122q93L987m198J267j480H52
611410I285n370k980L195J96l235n446j990Q024M50J059n119Q150n525M311r822B341
$$ plain form
594818 1567 -4164 -2285 1968 4441 -508 -1847 -3187 3048 1250 -3395 -110 2235 1250 1357 3550 1141
578097 3078 -164 -2314 -5761 -463 -7494 6218 1094 -2530 -459 595 3834 5430 -130 -4699 1941
562239 4388 -4630 4603 -2077 3877 248 206 -3937 -8436 1097 -4672 1048 -5127 4076 -15 1103 -3359
545268 -1136 1697 1480 -5093 -862 8376 2565 -3143 1265 2044 662 -2933 -5841 6146 2348 2769 343
528162 331 6547 -1853 118 7197 728 1489 -1393 -3005 -2862 -686 6675 2293 -5342 -3775 -64 -4647
510924 430 321 -1058 3842 -3077 -1328 397 -598 -4432 350 2641 -2362 1404 2781 1896 -5928 2034
493554 -2714 -1088 7583 5910 856 -2570 -22 -1006 4136 0 2194 10691 -1071 2953 698 2612
477079 -1701 -1541 170 -1958 -1823 2887 2107 -1978 5758 6122 3054 3087 3400 -252 -6598 5407 205 4509
$$ packed form
594818A567n731J879M253K473m949j339j340O235j798m645L285K345r85J07K193A141
578097C078l242k150l447N298p031J3712n124l624K071J054L239J596n560m569A941
562239D388r018R233o680N954l629m2m143m499R533n769N720o175R203m091J118c359
545268a136K833k17o573M231R238n811n708M408P79j382l595k908J1987l798M21C43
528162C31O216q400J971P079o469P61k882j612J43K176P361m382p635J567L711d647
510924D30j09j379M900o919J749J725r95l834M782K291n003L766J377q85p824B034
493554b714J626Q671j673n054l426K548r84N142m136K194Q497j1762M024k255B612
477079a701J60J711k128J35M710p80m085P736L64l068L3L13l652o346J2005n202D509
$$ plain form
458401 3704 687 1433 1813 5994 1203 -232 -4183 -6151 -3543 3819 3606 2022 -4799 -1705 92 -5328
440621 868 2769 6933 2607 87 1023 5444 3459 1931 -6687 -1299 1599 -1654 -1222 -4092 3459 -3071
422699 -4645 -2944 -554 5827 516 -398 3188 -775 3753 4366 455 -2058 -2130 -5252 1895 5255 -1450
404637 -1800 -1286 -3288 5387 -2435 -3674 5027 -5234 5679 5001 -785 -813 -1906 -2312 -1980 -2004 2066 -1057
385358 4336 1722 -1806 -1342 -801 -3132 3053 3647 -5241 1735 2483 5214 -1357 1020 5889 -45 2462
367003 -4360 969 3834 -139 -5797 -3254 -787 -5589 -731 1357 -1258 7312 3224 -4498 5370 216
349593 6042 25 -1084 -506 4317 7997 5220 8824 9402 6815 17766 43385 58837 104512 171896 258320
332054 321460 300515 215492 125690 78388 56888 58697 86484 117069 131156 114312 80894 64533
$$ packed form
458401C704l017P46L80M181m791j435l951j968K608P362k13j584o821L094J797e328
440621H68J901M164m326k520R36M421j985j528q618N388K898l253M32k870P551c071
422699d645J701K390O381n311r14L586l963M528O13l911k513p2l122P147L360a450
404637a800N14k002Q675p822j239Q701j0261J0913o78n786k8j093m06L32k4M070a057
385358D336k614l528M64N41k331O185N94q888O976P48K731o571K377M869n934B462
367003d360N329K865l973n658K543K467m802M858K088k615Q570m088p722R868B16
349593F042o017j109N78M823L680k777L604N78k587J0951K5619J5452M5675O7384B58320
332054C21460k0945q5023q9802m7302k1500J809K7787L0585J4087j6844l3418F4533
$$ plain form
317711 34142 25611 23868 16635 11589 4764 6862 1970 6386 1306 -750 5075 13848 583 6536 10429
299933 16941 17683 31923 44943 37450 46810 75209 99414 110961 88600 46920 23135 17068 4977
284269 6933 -1635 -1662 -2602 -1127 1874 2359 4344 2619 -519 -1732 -4267 4967 -2218 4476 -2338 5837
265111 -578 -1883 2506 -452 -2392 -2476 3897 1907 813 -805 423 51 -905 -4301 284 2328 5236 2960
244659 480 3847 -2750 5854 3452 1360 9304 13868 24075 27469 24432 23684 20749 14382 4763 5031 7586
225184 10678 10821 14345 18709 30495 51407 72827 113236 163864 267922 477595 754679 990660 947367
209028 706751 431413 255410 172823 133040 96689 68371 44425 31868 16159 13821 9373 7417
193931 4520 2743 2988 4513 -2502 4566 -4024 3451 2996 865 1225 2399 142 275 -1066 823 -59
$$ packed form
317711C4142q531j743p233n046o825K098m892M416n080k056N825Q773j3265N953A0429
299933A6941P42J4240J3020p493R360K8399K4205J1547k2361m1680k3785o067D977
284269F933q568k7r40J475L001M85J985j725l138j213k535R234p185O694o814E837
265111e78j305M389k958j940q4O373j990j094j618J228l72r56l396M585K044K908B960
244659D80L367o597Q604k402k092P944M564J0207L394l037p48k935o367r619K68G586
225184A0678J43L524M364J1786K0912K1420M0409N0628J04058K09673K77084K35981I47367
209028G06751k75338j76003q2587l9783l6351k8318k3946j2557j5709k338m448G417
193931D520j777K45J525p015P068q590P475m55k131L60J174k257J33j341J889e9
$$ plain form
174048 0 1260 3969 4137 10025 18302 26173 44211 41330 36010 34756 26437 20888 7232 3565 0 4299
154005 5446 7611 13818 12755 9024 8572 3825 755 0 1704 3357 9103 11976 21332 31882 39560 31683
133799 35142 50345 64455 76989 83219 75470 79363 103158 137910 157817 130952 114816 101044 110225
117037 133132 133569 121577 108162 91111 71494 81236 69753 56313 43992 37720 25730 9037 8231
100162 1172 432 7880 15455 21657 25673 25698 28927 21504 13624 8160 3101 0 8313 7410 1956 4404
79520 6485 9024 1900 1474 16747 41549 97867 150724 176456 145395 74149
$$ packed form
174048@J260K709J68N888Q277P871J8038k881n320j254q319n549j3656l667l565D299
154005E446K165O207j063l731m52m747l070p55J704J653N746K873R356J0550P678C1683
133799C5142J5203J4110J2534O230p749L893K3795L4752J9907k6865j6136j3772A10225
117037A33132M37j1992j3415j7051j9617R742j1483j3440j2321o272j1990j6693H231
100162A172p40P448P575O202M016K5L229p423p880n464n059l101Q313r03n454D404
79520F485K539p124m26J5273K4802N6318N2857K5732l1061G4149
66073e12  $$checkpoint
##END=