##TITLE= Raman spectrum of Nephrite (no. 5844) � http://rdrs.uaic.ro
##MINERAL= Nephrite
##CHEMISTRY= Ca2(Mg,Fe++)5Si8O22(OH)2
##JCAMP-DX= 5.01
##DATA TYPE= RAMAN SPECTRUM
##DATA CLASS= XYDATA
##ORIGIN= Department of Geology, UAIC, Romania
##OWNER= http://rdrs.uaic.ro � stud. Apopei Andrei Ionut
##LONGDATE= 2010/10/09 14:13:28.0976 +0200 $$ export date from JSpecView
##SPECTROGRAPHDATASYSTEM= HE 532 (Horiba Jobin-Yvon)
##XUNITS= Raman shift (1/cm)
##YUNITS= Intensity (cnt)
##XFACTOR= 3.188909E-3
##YFACTOR= 1.34441529E-4
##FIRSTX= 3399.61
##FIRSTY= 0
##LASTX= 210.701
##NPOINTS= 1024
##XYDATA= (X++(Y..Y))
1066073 0 7758 7697 7988 6988 6027 5477 5747 7053 4215 6890 7863 7136 6291 5016 3662 3247 1287 5458 3844
1050563 6256 2121 4338 2391 3983 1626 -66 -644 -1535 2734 1081 2164 3384 4682 9303 691 54
1037270 -3164 50 -685 4796 5078 5945 4037 624 -2417 -1296 1175 4506 5647 572 2867 -2286 301
1023883 -356 2095 1418 -1272 964 -1610 -762 2002 3768 6062 2844 4141 1040 852 -1389 416 2945
1010396 3538 6829 3884 4086 4015 6054 5045 2764 4511 -1425 1689 1500 5416 2549 4608 2269 3311
996808 3318 1232 1415 1323 5063 -404 6678 7075 4091 2513 3536 2252 5620 6134 5905 3702 3376 0
982311 3455 3236 2722 0 704 821 0 0 4748 6368 2925 5189 3212 2349 0 3535 6425 5171 4386
966889 3209 0 0 0 0 2073 0 547 2189 2111 0 3515 1674 3097 2760 0 0 0 0 1192 0 2258
948870 0 4203 0 2229 0 0 3509 0 0 2744 4101 4284 5211 0 0 1383 2630 3114 2151 2576
932341 2200 2214 0 0 0 2026 2919 5668 6970 5145 2752 5188 0 1669 1247 1431 1516 5629 5440 3453
915664 0 4789 0 3039 5588 2313 5898 1997 4878 2286 4933 7130 4069 4545 3634 4697 4625 1133
900531 3271 7324 4965 2294 5760 0 5143 5146 5050 9451 6950 5505 5683 1149 2480 4318 4808 0
885278 0 6084 3098 6895 0 4539 4270 2007 1560 0 0 4600 2065 3850 5401 4390 4591 2603 2452
869050 1304 703 2937 3508 5781 8150 1294 3448 774 1716 0 3020 2190 6070 0 3045 1555
854411 2977 1994 3201 1378 8312 3634 2514 5871 4183 7305 6243 4184 7149 4562 0 3033 4327
839663 2316 4157 1970 3771 1330 5906 6514 6848 4347 7730 1984 3236 872 3237 8594 5642 4879
824809 4625 2357 4037 5913 2491 5872 1902 2858 4322 0 7464 4782 4114 5674 7565 2322 4936
809838 7961 0 4384 4896 3982 5296 5965 7571 1652 5350 1111 0 4664 4871 4589 5695 9791 6714
793867 0 2536 2236 0 4501 5308 9300 0 6528 7445 4120 1831 2084 908 4151 5438 0 3663
777764 1969 3246 2627 3630 2306 7805 2708 2928 0 0 7222 8813 6729 6112 3480 4307 7481 0
761536 2135 2490 2161 5546 4062 4123 6939 2874 7136 6178 5318 5727 4220 484 3629 733 -1870 452
745176 1797 33 -3022 -2070 2576 2843 2542 -144 2487 2400 2000 -23 1374 -3797 -2596 1789 4473 3188
728688 -1029 -868 1972 -1914 729 -498 -5089 2734 3909 -2559 1705 -1186 -1985 49 -1983 -321 813
712990 91 -2549 -1396 -68 1163 184 2704 -4159 -1366 -391 2362 -1785 1632 -3591 -3009 2030 1126 2060
696241 -1503 -5595 -1828 -466 1776 -460 -3985 698 808 -510 -7829 -1935 -4250 -2011 1146 510 -47
680298 3044 5082 3034 -3216 1167 -1527 1369 -1325 -971 2980 -2041 1264 4412 2986 1677 -5536 -4832
664233 35 6778 3630 1791 -596 1376 -1344 -1757 1915 -434 2631 2196 588 368 911 201 2443 -593
647090 3427 2364 949 218 -5705 152 1201 -5844 -26 240 -1410 1143 5220 6014 9016 895 340
630771 -1643 -3177 1154 578 -702 1654 3 4920 2154 3923 7510 5095 5574 4215 2777 3862 0
614326 7595 4828 4251 3106 7121 1870 6958 5009 1867 1911 -1310 101 2372 3273 3803 -1103 1713 -379
596775 3562 6437 -2788 -3413 -520 -2103 -4097 2236 1960 1177 979 2169 -6162 -4699 -5387 -7639 -6061 -1433
579082 -2103 432 -3659 -6736 -4300 1303 -4998 -2835 -5383 -2007 -4007 53 -31 -2187 3769 1907 25
562239 5396 -43 -2120 -5291 -76 -5988 3174 1838 -4522 3232 2286 285 571 4140 2099 567 -67
545268 139 -3623 3112 6016 1256 5997 -1480 4472 6666 1016 4222 1523 740 2342 2848 109 -2219
528162 -4333 3484 2249 -4400 -1159 -635 1473 1684 7564 2909 -1785 -4191 -3060 945 -113 1536 -1135
510924 1218 -925 -585 -5191 857 5400 -5636 -1288 -1221 -685 653 1268 -3610 -4 122 -2840 -2146 -5557
492526 -4277 -4188 -1050 -258 866 -3736 -4449 -6803 -8520 -4783 -3588 4469 4630 1957 -13 6990 -4068 -2204
473977 -653 -2464 3073 -985 2267 573 717 4321 -1244 620 3579 -911 -3543 -1171 5956 663 3716
456319 241 676 407 4224 -1812 -6185 -375 -2598 418 -612 -3793 -1590 -3811 -4681 -6508 -3956 -3631
438520 -3638 -516 2254 1526 5961 1032 2515 5369 51 3005 222 1664 -1135 -747 1361 2159 5695
420583 4950 627 -3323 6683 798 -337 1134 4910 2999 -770 5158 2466 -1067 2947 2015 2980
403571 -4089 -523 2671 -683 2808 2371 -587 3082 3018 178 -1390 5741 -4369 -1050 -4004 -1817 -4615
385358 -2740 -83 -4577 -2447 -1646 -686 -4731 -7582 -5839 -3468 -3893 1880 -1514 -2151 1964 5727 265
367003 942 2441 5504 4268 8564 0 2492 0 0 0 3682 1833 1799 -776 541 -331 -1790 3477 -248
346316 -982 -619 8503 11780 8726 11301 15655 27849 43602 71787 117253 168897 248944 307978 295194
329853 213291 130018 74954 56133 59264 88766 122764 142512 123557 88026 63422 43706 29327
315493 15907 8899 2712 3466 2579 3040 1775 -2540 2860 -2119 191 5277 2896 8687 11644 20290 29756
296585 36154 37998 49870 70813 97913 101830 72888 39743 19460 9402 4602 346 2706 2075
280900 2072 429 1179 -3340 254 2186 3690 4609 5273 1364 1796 0 1055 1035 0 3147 0 0
260581 0 1738 994 -357 2965 521 1497 -868 31 -1670 -2081 265 -770 1088 -553 2185 3085 4338
240091 1375 8629 13401 22825 25486 29106 30243 28193 24288 16687 11453 9894 9273 11155 13076 17792 21102
220579 33052 47739 76187 117460 168584 258864 464554 760867 991480 974503 725922 447493 264105
205552 175954 137455 107636 76135 55915 31256 26166 15720 13542 9626 6569 5155 3820 -221
189267 1923 451 -3269 1299 688 2775 2711 -617 -74 2248 2108 130 -855 1986 2755 6164 7246 13059
168169 25245 40793 47819 47749 45158 39751 32781 24737 18334 9469 5803 5129 4122 7690 4905 4994 0
148079 0 3673 1755 1190 -489 999 478 11347 17172 23994 32185 27121 34666 45436 63849 69693 74775
127826 67560 74889 99459 131047 145784 137103 113506 97181 107070 131893 135331 123482 105260 82836
111023 75600 72175 62554 55846 42490 32399 18086 12863 4061 597 2517 6340 14150 16799 28147
92896 30952 22537 20474 14990 13670 1617 5326 4373 2675 1147 6143 6302 11585 4681 1508 14439
73416 48990 100467 162202 179327 160008 80405
66073D62  $$checkpoint
##END=