##TITLE= Raman spectrum of Orpiment � http://rdrs.uaic.ro
##MINERAL= Orpiment
##CHEMISTRY= As2S3
##JCAMP-DX= 5.01
##DATA TYPE= RAMAN SPECTRUM
##DATA CLASS= XYDATA
##ORIGIN= Department of Geology, UAIC, Romania
##OWNER= http://rdrs.uaic.ro � stud. Apopei Andrei Ionut
##LONGDATE= 2009/12/11 03:03:48.0120 +0200 $$ export date from JSpecView
##XUNITS= Raman shift (1/cm)
##YUNITS= Intensity (cnt)
##XFACTOR= 3.188909E-3
##YFACTOR= 5.55138885E-3
##FIRSTX= 3399.61
##FIRSTY= -13.59626776
##LASTX= 210.701
##NPOINTS= 1024
##XYDATA= (X++(Y..Y))
1066073b449K390N52j241L67K414K943J477j507l408k864q57L11q63q57K220K395B96
1052118C23K067l76k124n13j37K30K032J023j891k370n21K437L536Pk690m14P57A86
1037270F7L868M755J878n60j406l249m564j192K801J772j71K28M62N63j334n523d042
1023090A612K744n143j970K989J43r72Q78M50J822K793j589l785j278n31K91K660B941
1008800B506j160j607q4J977Q68J153L513P42m011l646j056J835N880P058L635A5672
995202I285m904m39n16k55L280N02m561o66K571j640j068L763J743k075j423j312A64
980696a052q47o11R36J059j127l072k409Q78K669J189Q05K141J872J104K47k011B06
966073B587K325k506m494j931P24J345J077J171J330J108k4k946l747J726N405C613
$$ y = [-2449, -59, 493, -748, -381, 2033, 4976, 6453, 4946, 1538, -1326, -2183, -1872, -2735, -3592, -1372, 1023, 296, 323, 2390, 2014, -110, -623, -760, -530, 1502, 2525, 634, -1736, -2257, 180, 3716, 3723, 1033, 619, 1376, 186, 67, 3935, 8690, 10568, 10008, 8602, 5353, 789, -403, 2398, 4170, 3999, 4227, 4689, 5252, 3918, -1605, -4042, 1612, 4356, -787, -2757, 232, 375, -597, 281, 731, 2553, 5346, 3757, -28, -1306, -1837, -1546, 1114, 2941, 2506, 1346, -261, -345, 1632, 2500, 3653, 7166, 7908, 3897, 251, -805, 1030, 6910, 13968, 17603, 15672, 9285, 4381, 3942, 3426, 3171, 6451, 6953, 2392, 1726, 4297, 2657, 1589, 5352, 7095, 5020, 3597, 2285, 164, -1052, -1899, -2510, -1574, -515, -1642, -4714, -7123, -6245, -3576, -2387, -1582, 559, 2431, 3535, 3782, 1771, 206, 2587, 4912, 2406, -2088, -4019, -3295, -1950, -873, 298, 1628, 2736, 2712, -234, -3981, -2255, 3150, 3613]
952160A147J806J537l255j012L315L63l115j815n66O72L179J750k329r98K994E175
938142C292j604j734k340J749M584K87k143M72q31l779j173J467J316K738J872A151
924018b839j312m14J366L273L93k388J48L361L113j50k971oM575M41o985m797c311
908954a601q35J690M115J355j163K04O05j277r54L94j142k655q18K058K859M27G25
893766f91J191K50q81J5n55k84K499J746j324o96q4j170M51P22k419r45K799M11a007
876754c94J197r97n19N93J71j08r13j069J626L123O97j435j128k12N57M22j135a589
860451a909L134M617J776k107k321N40K214l65m385k475K943O21m900q6O504J314I47
844881A152K569j766l245q48J701M262K838k226k503R7j606j980K500L122o81B306
$$ y = [1147, 2953, 4490, 1235, 223, 3538, 3901, 786, -1029, -1595, -923, 2256, 4006, 1677, 679, 3673, 5175, 3292, 1688, -46, -2386, -637, 3947, 4234, 2091, 2563, 1732, -2047, -3220, -1753, -437, 2301, 4173, 1151, -2839, -4151, -4565, -3199, 74, 467, -1921, -1773, 1588, 4701, 4551, 1580, 1574, 6149, 6590, -395, -5192, -3311, -1601, -2436, -746, 3369, 4724, 3561, 3765, 4370, 3093, 2139, 2533, 1391, -1264, -2082, -24, 2835, 3262, 725, -691, 500, 750, -131, -116, -671, -955, 1544, 3290, 1966, 1270, 1186, 16, 467, 1189, -1230, -2175, 624, 1035, -1007, -394, 803, -194, -713, -120, 51, -57, -970, -2039, -413, 2710, 3407, 1972, 844, 632, 1189, 1611, 476, -1589, -1909, 1225, 5842, 7618, 5511, 3190, 3730, 5944, 5579, 1194, -1281, 1662, 2283, -2617, -2703, 3801, 5115, 947, 1152, 3721, 1955, -1290, -2138, -437, 3825, 6663, 4437, 1934, 2031, 425, -1555, 945, 4067, 3386, 2306]
830064B178k492l642j52L541L271O24r99j651j681J251M079N43l902j222K249B618
815135B059j0q63p81J07l63K48k41l554q11O165L369l505j436J032k335k000J373c6
798317B241K843k88n67J681j640m887n75M097K413l509p605l251M191K373k891e145
783146a012J181j134j37J28O95J071m49k61J264k47j968o63K18k89M90J430J96h20
766058a062J571O48j78J700P10l173o54N821M802j621m797l825n5K502j277m708d462
749736b934j503l2N457M925K53j423p44j44J6k9Q07R39j588k484Q34K860J667G875
732363G360l322q25M849K751l359j320K951j675o970k959K714K017j304k802j736b062
716697A581J218k651k561P41J399q50J88L324J274l158l069j269o46J341L120B327
$$ y = [2178, -314, -3956, -4108, -567, 2704, 3328, 2329, 678, -1003, 248, 4327, 4870, 968, -254, 1995, 2618, 2059, 2049, 1186, 405, 512, 149, 397, 156, -3398, -4209, 1956, 5325, 1820, 384, 1416, -919, -2919, -1546, -36, 2241, 5084, 4796, 4229, 5910, 4270, -617, -1192, 2905, 5318, 1809, -5796, -9047, -4856, -2483, -5374, -5145, -1012, 169, -965, -1102, -974, -279, 792, 343, 82, 1346, 1099, -869, -1532, -1314, -1603, -1113, 317, 513, -820, -1062, 509, 1157, 979, 2679, 3389, 216, -438, 5383, 10185, 8564, 3767, -58, -113, 2389, 1112, -3596, -4462, -2934, -4437, -4469, 988, 5913, 6166, 4743, 3999, 3855, 3871, 3842, 4649, 5588, 4000, 1516, 2350, 5210, 6877, 7875, 7360, 4038, 3213, 8062, 10813, 7454, 6134, 9085, 7410, 440, -2519, 195, 2212, 908, -1894, -3630, -2062, 1581, 2799, 148, -2413, -1672, -273, -1123, -935, 2389, 3663, 505, -2564, -3833, -4479, -3138, -18, 2327]
700907C291j06P14L541J270n792o172k79K145J505j8l320l469j11O50J575M327A500
684062a535j513J553J086R57J577L15k241l828j614J993J356j80Q84k23j187K006A134
667078g88o74N41m66L114L234m567m691K441L054K411K795l602n303L552L746H61
650912A8N124J027l404k405j139P36K129m97k773p60J388k98k628O32N856K820B518
633659A500J086o106r219m22O767M336l3O61L701J352n612n927J716M476r57l568e274
616267a052J032k159p23j09j425J574N015R72l901j785J689J751P10p71j745k33D3
598735A95r70j10J679J853o06k540j529J47R62J257L68l05P56Q51n30n63l13m50A439
579082B965k542l811K95K073Q56J230k4k496J148N566O20o039m667n90K156M230B402
$$ y = [3291, 3185, 3899, 7440, 8710, 2918, -3254, -3533, -1388, 117, 99, -3221, -6690, -6801, -6151, -4576, -249, 1500, -1535, -3048, -1495, -409, 548, 2125, 2440, 199, -3629, -5243, -3250, -1894, -2074, -1190, -1413, -2600, -594, 1134, -788, -1462, -921, -1387, 1727, 4961, 394, -4297, -1856, 1198, 3609, 6404, 2802, -2501, 1051, 4797, 861, 18, 5142, 6169, 2765, 360, -779, -43, 2086, 1589, -1184, -1944, -556, -854, -3482, -2850, 3006, 5826, 2518, 1500, 2586, -3520, -12739, -13161, -6394, -2058, -2091, -1430, 2271, 3623, -1989, -7916, -6200, -1724, -2681, -6249, -5274, -1052, -20, -2179, -2902, -3011, -4436, -2862, 2153, 3125, -776, -2561, -872, 879, 1589, 818, -927, -1160, 43, 195, -775, -885, 794, 2647, 2041, -499, -2028, -1881, -919, 338, 706, 401, 1157, 2008, 1478, 915, 602, 152, 1439, 2965, 423, -3388, -3093, -1020, -164, 1066, 1042, -1454, -306, 5260, 5880, -159, -4826, -5416, -3260, 970, 2402]
561245b42N38K910k090j980L566J59n488j015K842p17j691L8j335j421J138J821a335
543261A79Q5l30M65l9j16Q16J26j301j684o29K307L066q75k416L44j54j668K047D256
523107D156k241o51n34n40L05o11l05K306Q25l221j515K449R03j678n8J222m6E18
503787A172N66k13j088p83J220J409j189k024o00m26m68R26J117m25n23R30M22b126
484300d044J721K484m40r67P06P14N76N56r16o06J381L20j155M76J009j95L24B379
464645A308j182n25p16o70j11J169J986l56k282J25J386p15n08J359J372Q41j244b558
444817c543K915P27j288O23j25j978L87K076J72l11J265J195p28j799m91J125A180
425873A852M98r12r83O56L26l54P46L73l86J005K33k002K20K294q50k134R19J062A025
$$ y = [-242, 296, 3206, 1116, -864, 2702, 2861, -2627, -3642, -800, -1517, -3208, -3170, -4505, -5926, -4788, -2967, -1335, 179, 264, -66, 399, 360, 244, 1060, 1186, -115, -1799, -2428, -121, 2945, 2070, -346, -2, -156, -1824, 223, 4256, 4156, 1915, 1264, 730, 190, 495, -116, -421, 1885, 2710, -511, -2026, 423, 1326, -352, -410, 812, 766, 518, 1172, 1738, 1525, 437, -346, 874, 2283, 1094, -930, -1530, -1956, -2424, -1498, -381, -806, -1329, -399, 23, -2126, -4044, -2323, 161, -279, -1246, -540, 174, 750, 1306, 390, -216, 1165, 1485, 330, 806, 1815, 1620, 1944, 2379, 1308, 126, -399, -1115, -1785, -1896, -727, 1259, 903, -1379, -1254, 132, -583, -1091, 268, 1640, 2481, 1237, -2558, -3543, -628, 99, -1189, -566, -691, -2669, -2282, -206, -34, -345, 920, 2115, 1387, -412, -903, 222, 1180, 1852, 2350, 1438, 455, 1111, 1437, 1083, 1829, 2202, 1816, 2821, 3054, 1052, 1272, 3566, 2716, 582, 1501, 2563, 1025]
404637b72P8o52r04J007J594n52j201Q76J042j028p71J332J876J052k36j781k771d139
384282e050K133J431j590L65L529K68k722P89K885j99j780j06J083M71j066j238f22
364833i43j593K45J468n40J12L227J960j097n79q3j141L1J040j140j747Q05J409A323
344127A082l6o71j14J012j3j622l46K141J583p84r36j77q22l70J296O37o11M71B587
322132B061p18l81q15m27N2l23K54Q75r1m16K22l33q77P0J011M68j424j936P76D17
298818G79l17J126P58N9P3j510k037p8J61k34J334J165l69M07N58o73K50K73k362b589
275273a537J246J86M06K00k62K69N80m08j460m72J292N19n57R58P82j649o07J320B12
252633h12J812J488j404j849q48l5J314K134R84j267j908l71p7p52J228K119j001e18
$$ y = [-272, -194, -846, -1750, -743, 851, 299, -902, -26, 1016, -12, -783, 549, 2425, 3477, 3241, 1460, -1311, -4139, -5050, -2917, -1486, -3076, -2711, 818, 1086, -1636, -847, 2038, 1839, 59, -47, 1036, 1507, 441, -797, -622, -943, -2536, -2291, -823, -1363, -1251, 1976, 3936, 2839, 2260, 2177, 1036, 1067, 2107, 967, -780, 25, 1434, 1323, 1082, 1046, 375, 261, 1273, 1260, -362, -708, 1433, 3016, 2232, 1296, 1119, 297, -73, 1223, 1860, 1249, 1720, 2587, 2061, 1343, 962, 147, -280, -228, -551, -297, 578, 487, 71, 293, -40, -917, -847, 164, 632, -792, -2728, -1952, 417, 779, 462, 1588, 2346, 2405, 2478, 968, -1069, -1147, -986, -1220, 114, 1279, 910, 1317, 1875, 1202, 1452, 1725, -637, -2589, -1537, -291, -105, 301, 501, 239, 508, 1088, 680, -780, -1252, 40, 559, 2, 960, 1742, 93, -514, 806, 212, -812, 1000, 2488, 1084, -765, -1613, -1648, -334, 1800, 2784, 1517, -391, -762, -839, -1591, -363, 1756, 755, -518]
230928A172P31j322m88r16j276J067R60o38J123J804J11Q33J064p13K53P56k308c12
209028e1P75J010J243j503k915k98J006o84j743m35J657J460K93J694J627j819E06
188099C710J666R95O491O233j968n116k828l181l720p51J853J086j053j426o79c94
168169b253K275M841R07l446k659M73J694M31k49J177R88j490j457M44O90J303E533
146892D740k051J067J644j741k345J40J769J793k31k277q44O29o05Q63M457L333A2016
125432A8715J4745K3589L4254L6129K0234J756R707O5038J62929K51093K44555I86839
109818H84937k46692k63421j91004j04460m2464n789K4476O8911J11587J03864C76867
95320C45413m7810k3473q898k9757o2148p0633n2599k8739j1574k686p59j432C772
$$ y = [1172, 1903, 581, 93, -823, -2099, -1032, -72, -710, 413, 2217, 2328, 3161, 4225, 3512, 3765, 4521, 2213, -312, -51, 724, 1734, 2977, 1474, -1441, -1739, -733, -1417, -3160, -3595, -1938, -478, -185, 1509, 3136, 1317, 506, 3710, 5376, 6371, 12862, 19095, 17127, 12011, 9183, 6002, 2282, 1531, 3384, 4470, 3417, 1991, 1312, -394, -2253, 22, 4863, 5770, 2324, -335, 138, 1832, 2263, 2014, 3191, 4179, 2689, 1232, 1676, 2366, 3669, 5533, 4740, 2689, 3756, 5400, 3659, 1314, 1454, 3223, 5016, 4785, 2508, 1664, 2293, 1688, 2551, 7008, 10341, 12016, 18715, 33460, 57049, 91303, 127432, 147666, 149422, 159129, 224167, 387096, 638189, 882744, 986839, 884937, 638245, 374824, 183820, 79360, 36896, 31107, 55583, 124494, 236081, 339945, 376867, 345413, 297603, 274130, 265232, 235475, 173327, 102694, 50095, 21356, 9782, 7096, 6337, 4905, 3772]
78300C547K73j80r35l67J82q51r64L58A358
$$ y = [3547, 3820, 3640, 2705, 2338, 2520, 1669, 705, 1063, 1358]
66073I59  $$checkpoint
##END=