##TITLE= Raman Spectrum of Pargasite (no. 3985) (3-2 black and red) � http://rdrs.uaic.ro
##JCAMP-DX= 5.01
##DATA TYPE= LINK
##ORIGIN= Department of Geology, UAIC, Romania
##OWNER= http://rdrs.uaic.ro � stud. Apopei Andrei Ionut
##BLOCKS= 2
##TITLE= Raman spectrum of Pargasite (no. 3985) � http://rdrs.uaic.ro
##MINERAL= Pargasite
##CHEMISTRY= NaCa2(Mg,Fe++)4Al(Si6Al2)O22(OH)2
##JCAMP-DX= 5.01
##DATA TYPE= RAMAN SPECTRUM
##DATA CLASS= XYDATA
##BLOCK_ID=1
##ORIGIN= Department of Geology, UAIC, Romania
##OWNER= http://rdrs.uaic.ro � stud. Apopei Andrei Ionut
##LONGDATE= 2010/10/09 16:01:36.0258 +0200 $$ export date from JSpecView
##SPECTROGRAPHDATASYSTEM= HE 532 (Horiba Jobin-Yvon)
##XUNITS= Raman shift (1/cm)
##YUNITS= Intensity (cnt)
##XFACTOR= 3.188909E-3
##YFACTOR= 3.66270609E-4
##FIRSTX= 3399.61
##FIRSTY= 297.59633342
##LASTX= 210.701
##NPOINTS= 1024
##XYDATA= (X++(Y..Y))
1066073D75188N716N056m785M657O31N139j687K447m997L768m358N8j404M125r526D86592
$$ 475188 480904 485960 481175 485832 486463 491602 489915 492362 487365 491133 486775 486833 485429 489554 480028 486592
1052896D86118j819N512m582J363p77M32L166k896K9N61l656o331O834o61l506D86376
$$ 486118 484299 489811 485229 486592 485815 486247 489413 486517 486546 487107 483451 477120 483954 483293 479787 486376
1039622D86762n114K048K867k439K065o61K609M57R06l727K464K293K663l938r47D92449
$$ 486762 481648 483696 486563 484124 486189 485528 488137 488594 489500 485773 488237 490530 493193 489255 488308 492449
1026251D90472n44j118j591O448R01p449P1K439m026M254k380J865j45M985l681D90073
$$ 490472 489928 488810 487219 493667 494568 487119 487190 489629 485603 489857 487477 489342 489197 494182 490501 490073
1012782D85345J533j562L021n413K077N442l926M856k392N89n458K9M540J276q60D85744
$$ 485345 486878 485316 488337 482924 485001 490443 486517 491373 488981 489570 484112 484141 488681 489957 489097 485744
999213D87880K866j836M470m196q89K966n014K106j790j504N816j29l323p77L668D92046
$$ 487880 490746 488910 493380 489184 488295 491261 486247 488353 486563 485059 490875 490746 487423 486646 490314 492046
985544D90185P1K048K45J907o448K908j416k538J994L493k206J990m295K908l353D89454
$$ 490185 490256 492304 492549 494456 488008 490916 489500 486962 488956 492449 490243 492233 487938 490846 487493 489454
971774D82724N056m042K750O061j778M587l582N16q02K060k12r30o020M499l880D90958
$$ 482724 487780 483738 486488 492549 490771 495358 491776 492292 491490 493550 493338 492408 486388 490887 487007 490958
957901D90771M200k276n247p15K036J146K821k177j890J230J288O592l539j118D97663
$$ 490771 494971 492695 487448 486733 488769 489915 492736 490559 488669 489899 491187 497779 494240 493122 497663
944753D91502j346J475K738l195J907M154j362L294r052J101n185R47K393k052D89554
$$ 491502 490156 491631 494369 491174 493081 497235 495873 499167 490115 491216 486031 486978 489371 487319 489554
931510D88038O160J446k322j201r18N301l45p133J961M886N8m483K933Q06k152D88125
$$ 488038 494198 495644 493322 492121 491203 496504 496159 489026 490987 495873 495931 491448 494381 495187 493035 488125
917339D91976N845j059l756n513O361j733%K406l440K995J620l739J774k118O688D94439
$$ 491976 497821 496762 493006 487493 493854 492121 492121 494527 491087 494082 495702 491963 493737 491619 498307 494439
903061D97966l585j142J246n072M241k966L008K148M769k750K737n699j089J516D94655
$$ 497966 494381 493239 494485 489413 493654 490688 493696 495844 500613 497863 500600 494901 493812 495328 494655
889527D98008N384n197J00K41j376n98m329K049O347n001m70r76L037n758M295E01103
$$ 498008 503392 498195 498295 498536 497160 496562 492233 494282 500629 495628 495158 494182 497219 491461 495756 501103
875045D97235J330K309q308K5M370m084J720J089M142k46L29k032J645k663N9D95943
$$ 497235 498565 500874 492566 492591 496961 492877 494597 495686 499828 499582 499911 497879 499524 496861 496920 495943
860451D96604K891n068J674n73O89j088l826O248l913M428k908J645J46p379P279D96517
$$ 496604 499495 494427 496101 495528 496217 495129 491303 497551 493638 498066 495158 496803 496949 489570 496849 496517
845750D93737J75k065J533l510N704m500K323l926J632J201j400M080p607L095D92736
$$ 493737 493912 491847 493380 489870 495574 491074 493397 489471 491103 492304 490904 494984 487377 490472 492736
831814D98249m080k708L610j16J362n617K879m939M237l768L428L664o676L224D92508
$$ 498249 494169 491461 495071 494955 496317 490700 493579 488640 492877 489109 492537 496201 489525 492749 492508
817778D93550K87n86L324m956n114P419j703k252m98k9q60J188j645O518o722D86359
$$ 493550 493837 493251 496575 491619 486505 493924 492221 489969 489471 489442 488582 489770 488125 494643 487921 486359
802754D95615o734P02l967M827l16k247k00l697N500K796q541M528n57p324O980D85674
$$ 495615 488881 489583 485616 490443 490127 487880 487680 483983 489483 492279 483738 488266 487709 480385 487365 485674
787620D88208j58n014k505M540R60m067J890J018k16l28k9j276J475k16j271k33D83023
$$ 488208 488050 483036 480531 485071 486031 481964 483854 484872 484656 484328 484299 483023 484498 484282 483011 482778 483023
771471D80128J977M728k522M657j919k16K434j475k791j920N875%l33M16K03J159D89886
$$ 480128 482105 486833 484311 488968 487049 486833 489267 487792 485001 483081 488956 488956 488623 489039 489242 490401 489886
755189D91045N03J417p73P1J375L03L078j99j018k58l311J17K708o622Q928m956D95844
$$ 491045 491548 492965 492192 492263 493638 493941 497019 496820 495802 495544 492233 492350 495058 488436 497364 492408 495844
738779D97734k003j649K480k808J703J46R30Q596P818j533k57m383p391M009j1316D95029
$$ 497734 495731 494082 496562 493754 495457 495603 496533 505129 512947 511414 511157 506774 499383 503392 492076 495029
723163D92092O776P85j317J75m113L622k019J346n043M183K024l153j317n060D91315
$$ 492092 498868 499653 498336 498511 494398 498020 496001 497347 492304 496487 498511 495358 494041 488981 491315
708352D98108l58m669j965J965j035M155m740K048m412K119J919l020N02p02k667D88254
$$ 498108 497750 493081 491116 493081 492046 496201 491461 493509 489097 491216 493135 490115 490617 489915 487248 488254
692500D90601m026L311m873j030J117K476N646k551j387Q43Q122q263m03J346D95773
$$ 490601 486575 489886 485013 483983 485100 487576 493222 490671 489284 490127 498249 489986 489583 490929 495773
677473D90302o32l838J960P192l897k106k206L323L739k734j304K896K019k16D94095
$$ 490302 489670 485832 487792 494984 491087 488981 486775 490098 493837 491103 489799 492695 494714 494498 494095
662336D96591r18k866l237K680j579R06Q85q151O593J703k048m61j687j74m599D82047
$$ 496591 495673 492807 489570 492250 490671 491577 492462 484311 490904 492607 490559 490098 488411 488237 483638 482047
646133D85715K29K825k165q637O003J417J475k592J703J047n073r89k131K576D83896
$$ 485715 485944 488769 486604 477967 483970 485387 486862 484270 485973 487020 481947 480958 478827 481403 483896
630771D79085K090J57n670Q72r89M512N61J58l669r01q31P087l406K650L195p021D79799
$$ 479085 481175 481332 475662 476534 475545 480057 480618 480776 477107 476206 475375 482462 479056 481706 484901 477880 479799
613354D81503m283K334K726K592K551k809k152N61N027m940L665n45m137k264D82321
$$ 481503 477220 479554 482280 484872 487423 484614 482462 483023 488050 483110 486775 486230 482093 479829 482321
597756D85919l311L465j29k534J362J458j030K264Q31k937j118K194L066q753D84386
$$ 485919 482608 486073 485944 483410 484772 486230 485200 487464 488295 485358 484240 486434 489500 480747 484386
582042D83754k879J172j874J12q84O185O73p506M428k094l477k9j076k206M096D76891
$$ 483754 480875 482047 480173 480285 479401 485586 486259 478753 483181 481087 477610 477581 476505 474299 478395 476891
565222D73655N214j363j961j474L44k492R01o02j803n19J117l57N32P0o44N214D78753
$$ 473655 478869 477506 475545 474071 474415 471923 472824 472222 470419 469900 471017 470660 471192 471262 470618 475832 478753
547272D74212k219P233n770L892l506m025j46K925L481n19j861J819n729n31M054D71092
$$ 474212 471993 479226 473456 477348 473842 469817 469671 472596 476077 475558 473697 475516 469787 469256 473310 471092
530181D74802n44K762K74R31k551k505k339p56J832O15j633o56R14j101J70J164D65616
$$ 474802 474258 477020 477294 478225 475674 473169 470830 470074 471906 472521 470888 470232 471146 470045 470215 471379 465616
511943D66605K422n903L153q60K322j217K908l814J322L248r426r01j376J247D58355
$$ 466605 469027 463124 466277 465417 467739 466522 469430 465616 466938 470186 460760 459859 458483 459730 458355
495605D59372K921k160p682L710O03n987N687K522J633n085j463L00L971k679D56734
$$ 459372 462293 460133 452451 456161 456764 450777 456464 458986 460619 455534 454071 454371 458342 455663 456734
479145D53357k33J421p31M582R47m067K821k422j691o086P033j87J58k808k106D48700
$$ 453357 453124 454545 453814 458396 459343 455276 458097 455675 453984 447898 454931 454744 454902 452094 449988 448700
461525D55692k87k048m32J749o876L266L57j516m832j246N546J720l324J575k293D40919
$$ 455692 455405 453357 452925 454674 447798 451064 451421 449905 445073 443827 449373 451093 447769 449344 447051 440919
443769D42527m45J304J346K364o460K435J632K265m400J533l45R76o804J462L149D44359
$$ 442527 442082 443386 444732 447096 440636 443071 444703 446968 442568 444101 443756 444732 437928 439390 442539 444359
425873D37525l16m99l527L868j001K709L639j29R72l465J820Q02L722m109O157D49988
$$ 437525 437209 436710 433183 437051 436050 438759 442398 442269 443241 439776 441596 442398 446120 442011 448168 449988
407835D47466m682J645k575L394K762p85o60M32J229k189L348m324M815l727J732D45389
$$ 447466 442784 444429 441854 445248 448010 447225 446565 446997 448226 446037 449385 445061 449876 446149 447881 445389
389657D49975O776m657j12j924j82m32k007m15K538K318J221l124j678K9K422D50690
$$ 449975 456751 452094 451982 450058 449876 449444 447437 447022 449560 451878 453099 449975 448297 448326 450748 450690
371334D53141j919L223j865J176n03K87j29K106m927L411K119m242J707J978L394D57366
$$ 453141 451222 454445 452580 453756 453253 453540 453411 455517 450590 454001 456120 451878 453585 455563 458957 457366
352867D56751M370M267N102R999O846N414R59J2580R426l336Q151L248N576J1270E50523
$$ 456751 461121 465388 470490 480489 487335 492749 493708 506288 515714 512378 520529 523777 529353 540623 550523
335353E55554J7345O593P660J7149J4096J0486J0614M873J762J2018J2521J3494F87060
$$ 555554 572899 579492 587152 604301 618397 628883 639497 644370 646132 658150 670671 684165 687060
319921F96773P848L739J807j7735r314j4769k3393q234p208l394q853n471L049F12282
$$ 696773 704621 708360 710167 692432 683118 668349 644956 636722 629514 626120 617267 611796 614845 612282
303276F09902p046o589q612o934P61l681K476m396Q509O061O215k464J778Q608F10977
$$ 609902 602856 596267 587655 580721 581482 577801 580277 575881 584390 590451 596666 594202 595980 604588 610977
285392F10703R971Q080n255K006K962J321l539p952p905Q02k838n488l423J176F07426
$$ 610703 620674 628754 623499 625505 628467 629788 626249 618297 610392 611194 608356 602868 599445 600621 607426
267373F00762L082N256N604M424P478N201J3594J3622J0946J7764K0211L2263G65590
$$ 600762 603844 609100 614704 619128 626606 631807 645401 659023 669969 687733 707944 740207 765590
251495G96062L7332K5815K9708K5399J1620K3763J6663J2364L3720R871J932j1200I82149
$$ 796062 833394 859209 888917 914316 925936 949699 966362 978726 1012446 1022317 1024249 1013049 982149
235514I27727l9384m5926k5711k2176l2147j5471j0573l394o622K0602K5873L1544H38092
$$ 927727 888343 842417 816706 794530 762383 746912 736339 732945 726323 746925 772798 804342 838092
219426H88833M2761L4324L1041M2549O9332R4391R5580Q7441M2748j0000m6803A332403
$$ 888833 931594 965918 996959 1039508 1108840 1203231 1298811 1386252 1429000 1419000 1372197 1332403
204393A271691p2485p7114o9780o6910o0068m3879l2690j7993j7033q940q02O589H09930
$$ 1271691 1199206 1122092 1052312 985402 925334 881455 848765 830772 813739 804799 803997 810586 809930
188099H27461L3650K4856L2549K7444N073o448m495n272l124J29q251O618J2949I47024
$$ 827461 861111 885967 918516 945960 951033 944585 940090 934818 931694 931823 923572 930190 943139 947024
170523I51178J3078n987J990n130r89j6846l149K019J820j6144j5014k3609l2205H29140
$$ 951178 964256 958269 960259 955129 954140 937294 934145 936164 937984 921840 906826 883217 851012 829140
152821H14986k75j358j6044J603l211p233j1773m757j807j0627r227N916K252G63114
$$ 814986 814711 813353 797309 798912 795701 788468 776695 771938 770131 759504 750277 756193 758445 763114
134992G73371J2920L856K147O344n571M699k534J3422J5583J5990J3897J8620H88431
$$ 773371 786291 790147 792294 798638 793067 797766 795232 808654 824237 840227 854124 872744 888431
118238I04662Q624P981J0643R638M803J159J5429J3610K6326K0402J8321L1560A082784
$$ 904662 913286 921267 931910 941548 946351 947510 962939 976549 1002875 1023277 1041598 1073158 1082784
101371A083183N446j5300l1731m1228k0959k5313k3937k4681k3809k8395k1989H14284
$$ 1083183 1088629 1073329 1041598 1000370 979411 954098 930161 905480 881671 853276 831287 814284
85608H11475l195L856K0568K2163L2920L8893M8003O2631J01325J46076J05865A433183
$$ 811475 808280 812136 832704 854867 887787 926680 974683 1037314 1138639 1284715 1390580 1433183
69748A374848j27352A099717
$$ 1374848 1247496 1099717
66073I80570  $$checkpoint
##END=
##TITLE= Raman spectrum of Pargasite (no. 3985) � http://rdrs.uaic.ro
##MINERAL= Pargasite
##CHEMISTRY= NaCa2(Mg,Fe++)4Al(Si6Al2)O22(OH)2
##JCAMP-DX= 5.01
##DATA TYPE= RAMAN SPECTRUM
##DATA CLASS= XYDATA
##BLOCK_ID=2
##ORIGIN= Department of Geology, UAIC, Romania
##OWNER= http://rdrs.uaic.ro � stud. Apopei Andrei Ionut
##LONGDATE= 2010/10/09 16:06:27.0685 +0200 $$ export date from JSpecView
##SPECTROGRAPHDATASYSTEM= HE 532 (Horiba Jobin-Yvon)
##XUNITS= Raman shift (1/cm)
##YUNITS= Intensity (cnt)
##XFACTOR= 3.188909E-3
##YFACTOR= 6.2544431E-4
##FIRSTX= 3399.61
##FIRSTY= 31.27437404
##LASTX= 210.701
##NPOINTS= 1024
##XYDATA= (X++(Y..Y))
1066073B49309L138Q350m148k182K67n33J490J754M202m681L192M893n637q456B54148
$$ 249309 252447 260797 256649 254467 254734 254201 255691 257445 261647 256966 260158 265051 259414 250958 254148
1053674B53776K765q562J5369J224K65m944J59q775L138j755N264m573l73K128B58883
$$ 253776 256541 247979 263348 264572 264837 259893 260052 251277 254415 252660 257924 253351 252978 255106 258883
1041190B61114R626j3189n210K978M999n532j329O116K553q244P765j118k924K288B61114
$$ 261114 270740 257551 252341 255319 260318 254786 253457 259573 262126 253882 261647 260529 257605 259893 261114
1028618B55904J861p658O648L882n106P021J700K659k339q031m839O861L20K499B64041
$$ 255904 257765 250107 256755 260637 255531 262552 264252 266911 264572 256541 251702 258563 258883 261382 264041
1015959B67496p923n637K713J489N85k501M307o487K393j435l138R572l615R517B64677
$$ 267496 259573 253936 256649 258138 258723 256222 260529 254042 256435 255000 251862 261434 257819 267336 264677
1003215B56275J595m040M040j061K816j381K11N4L458p340R679o647J595l989m25B58030
$$ 256275 257870 253830 257870 256809 259625 258244 258455 258509 261967 254627 264306 257659 259254 255265 254840 258030
989574B61114l084k711L296N85M415j1008P337m253l72N264R05N3j1274J1167B57074
$$ 261114 258030 255319 258615 259200 263615 252607 259944 255691 255319 260583 261488 261541 250267 261434 257074
976644B59040l349K65M25J863m947j329N956m253P817L457k767p072L563J543B58509
$$ 259040 255691 255956 256381 258244 253297 251968 257924 253671 261488 264945 262178 255106 258669 260212 258509
963624B55585J701K607n85n745O381Q53K180m414n33k234n423K339L192M200o37B65103
$$ 255585 257286 259893 259308 253563 259944 260797 262977 258563 258030 255796 250373 252712 255904 260104 259467 265103
949692B58190l20L883p45m573Q51j276P99K339O91k925l723Q297n266J597j010B52447
$$ 258190 257870 261753 261008 256435 257286 256010 256809 259148 259839 256914 253191 261488 256222 257819 256809 252447
935655B55319j597P606k340m202J60O807n31k499n4n478K500N212J05m042j221B54201
$$ 255319 253722 261328 258988 254786 254946 261753 261222 258723 258669 253191 255691 260903 261008 256966 255745 254201
921516B62552O36j0051R59M79n851P871R04J541m200J224Q50K819J010J755l404B59467
$$ 262552 263188 253137 254096 254575 248724 256595 257499 259040 254840 256064 256914 259733 260743 262498 259094 259467
907273B57445Q085j863q933J595K925l138O436j969K979o542M148m202P99M946B62126
$$ 257445 265530 263667 254734 256329 259254 256116 262552 260583 263562 257020 261168 256966 257765 262711 262126
893766B66646o488n33M308r572J489m361m041J2125J170M148n743R04m840R254B58563
$$ 266646 260158 259625 263933 254361 255850 251489 247448 259573 260743 264891 259148 260052 255212 264466 258563
880169B56222J012m043M80K978L934J755l988J010L192j224r680L829j06l349B48670
$$ 256222 257234 253191 253671 256649 260583 262338 258350 259360 262552 261328 251648 255477 255371 252022 248670
866475B58296l031l669J0317j0265M468j06j968K447l936L563o701J437P977J329B61647
$$ 258296 255265 251596 261913 251648 256116 256010 254042 256489 252553 256116 249415 250852 258829 260158 261647
852683B61488m733r59k978M362p392M733k180Q029p869N637n052M784m359j224B60957
$$ 261488 256755 255796 252818 257180 249788 254521 252341 260370 252501 258138 253086 257870 253511 252287 260957
838795B55585r58l510K925N158o593l74l349L828J436k074k180P180q881L403B54415
$$ 255585 254627 251117 254042 259200 252607 252233 248884 252712 254148 252074 249894 257074 248193 251596 254415
824809B53137m307L882k978n85N052O169q189l776J064j170P44J543J58J278K712B52181
$$ 253137 248830 252712 249734 249149 254201 260370 252181 248405 249469 248299 249043 250586 250744 252022 254734 252181
809838B47235O595l244K817M27l671p44L830J276l458l988M468n638Q51J3029B54148
$$ 247235 253830 250586 253403 253830 250159 249415 253245 254521 251063 247075 251543 245905 246756 259785 254148
795645B48884k659J275R58L298l403P392m468j914l192n85k126j649P178N4j595B41811
$$ 248884 246225 247500 248458 251756 248353 255745 251277 249363 246171 245586 243460 241811 248989 249043 247448 241811
780458B47554J60N212q244J0689n583J06k340O117k713k340j595l246L564L73B53245
$$ 247554 247714 252926 244682 255371 249788 249894 247554 253671 250958 248618 247023 243777 247341 247714 253245
766058B49469j544o90J862R02j487k766P340j170k501l084L351L404l777o39J383B51437
$$ 249469 247925 247235 249097 249999 248512 245746 253086 251916 249415 246331 249682 253086 249309 248670 250053 251437
750645B44576R679p924K65L511n052N158m893K234J276N85N371m679k872N85R58B43246
$$ 244576 254255 246331 246596 250107 245055 250213 245320 247554 248830 249415 254786 250107 247235 247820 248778 243246
735117B52660l191L243n104J3400P392j914j755j2338j0741J4198m042J118q52B46810
$$ 252660 249469 252712 247608 261008 268400 266486 264731 252393 241652 255850 251808 252926 252074 246810
721316B55265j59l138K339r092L509k020k66m735O436J010l669j064l19J543N637B47714
$$ 255265 255106 251968 254307 245215 248724 246704 246438 241703 248139 249149 245480 244416 244097 245640 251277 247714
705564B46225J860p977R626k286j808K393n425k234K288K13J541O222n158l777B48884
$$ 246225 248085 240108 249734 247448 245640 248033 242608 240374 242662 242875 244416 250638 245480 241703 248884
690628B49255m465N743k659Q50J064J275q881L298M254m308J08J435L244j755B54201
$$ 249255 244790 250533 247874 248724 249788 251063 242182 245480 249734 245426 245534 246969 250213 248458 254201
675585B48884k340j06L829j437m77r59J60K66m043P871j806n372K819O487p98B47394
$$ 248884 246544 246438 250267 248830 248353 247394 247554 247820 243777 251648 249842 244470 247289 253776 252978 247394
659486B51489p923M627R56r56l723J701o807P817Q084j1274P871n957L192p44B42556
$$ 251489 243566 248193 249149 248193 244470 246171 239364 247181 255265 243991 251862 245905 249097 248353 242556
644220B48618r04n4k074k12J06k287l564O809k447N158o062j064M096j968M946B45055
$$ 248618 247714 247660 245586 245374 245480 243193 239629 246438 243991 249149 243087 242023 246119 244151 249097 245055
627876B44682j807m79N903l723j116K605j2815J2921j915K394n372Q456j116k553B40428
$$ 244682 242875 242396 248299 244576 243460 246065 233250 246171 244256 246650 241278 249734 248618 246065 240428
612382B49948o488o93K819N85o91p020N212j06j435K551J277M79j07k925R04O169B43352
$$ 249948 243460 242767 245586 246171 245480 238460 243672 243566 242131 244682 245959 246438 246331 243406 244310 250479 243352
594818B45161K553r04j064M840n319P074m362n31l563J701n85j224N320m521M094B49522
$$ 245161 247714 246810 245746 250586 245267 252341 247979 247448 243885 245586 245001 243777 249097 244576 248670 249522
578097B48245J2763r306k605j437R04O39l298J649k713j329O382o648J809R04B47714
$$ 248245 261008 251702 249097 247660 248564 249203 245905 247554 244841 243512 249894 243246 245055 245959 247714
562239B52978j330o541n2P45K65l71L17Q53o39M519l17n426N426J116l618L298B46384
$$ 252978 251648 245107 245055 245800 246065 245694 246011 246864 246225 250744 250427 245001 250427 251543 247925 251223 246384
544265B51012n586l349q51J1327j60o114n4J435k553J383n104N31R146Q564o010B48778
$$ 251012 245426 242077 241226 252553 252393 246279 246225 247660 245107 246490 241386 241917 251063 259627 253617 248778
527152B48139M573k11o39p99n529N104J06R04p44M25m25P126j3348j116P178M096B44630
$$ 248139 252712 252501 251862 251063 245534 250638 250744 251648 250904 251329 250904 258030 244682 243566 250744 254840 244630
508889B50159K182L404r574N691l350L404j383k500N957n106P44l19j595J489B50904
$$ 250159 252341 255745 246171 251862 248512 251916 250533 248033 253990 248884 249628 249309 247714 249203 250904
492526B47660j381k819K499J755M573O39m25m308O91O328r838L456r56P871q53B60052
$$ 247660 246279 243460 245959 247714 252287 252926 252501 248193 248884 255212 245374 248830 247874 255745 254892 260052
475012B53137J064o38n478O490o490K14K445k499P392k234k765m359L349k180B55425
$$ 253137 254201 253563 248085 254575 248085 248299 250744 248245 255637 253403 250638 246279 249628 247448 255425
458401B52766j862k074r56L030n85M573n689M25J701p444Q242j383l244j914N372B52233
$$ 252766 250904 248830 247874 250904 250319 254892 249203 249628 251329 243885 252127 250744 247500 245586 250958 252233
440621B48458R05m25J754R04k074K66k340M254j0530O328L883l138O382k180m787B43141
$$ 248458 249363 248938 250692 251596 249522 249788 247448 251702 241172 247500 251383 248245 254627 252447 247660 243141
422699B49948j703l881O540m040J59P392r095J7391j1434J224l617N583o91J384B53351
$$ 249948 248245 244364 250904 246864 247023 254415 245320 262711 251277 252501 248884 254467 253776 255160 253351
405706B48564J809J60L297Q348j60j541m79k872P44j115P497K074j010N85K819B71167
$$ 248564 250373 250533 253830 262178 262018 260477 259998 257126 257870 256755 264252 266326 265316 265901 268720 271167
387509B72337k499K710m625O540m520J06M25J809j010J329J649O37M415l032P45B77176
$$ 272337 269838 272548 267923 274463 269943 270049 270474 272283 271273 272602 274251 274888 279303 276271 277016 277176
369170B75846M094m359O168j064l18K446J1328k393o436m202J2233l244l138M413B87226
$$ 275846 279940 275581 281749 280685 280367 282813 294141 291748 285312 281110 293343 290099 286961 291374 287226
351779C01265J2285N87M785J8346J330M893J6540M360N531K499R572J8029L669D15020
$$ 301265 313550 314137 318922 337268 338598 343491 360031 364391 369922 372421 381993 400022 403691 415020
335353D17359k65K3399m362J9942K3134M627%J9145m361K0315J1540J3188M841E60094
$$ 417359 417094 440493 436131 456073 479207 483834 483834 502979 498618 518933 530473 543661 548502 560094
318818E56744J3668J755k234q987j5955r412j6646L244j0105l669N477J0904o542E20795
$$ 556744 570412 572167 569933 560946 544991 535579 518933 522177 512072 508403 513880 524784 518242 520795
302162E18613l934n85p711N158Q350L455k659L352J3081M096J1540o595J0104E51478
$$ 518613 514679 514094 506383 511541 519891 523346 520687 524039 537120 541216 552756 546161 556265 551478
285392E60202l032J8027q773J1007l615R571r731O382o170n530j2392j1326l084E36270
$$ 560202 557170 575197 566424 577431 573816 583387 573656 580038 573868 568338 555946 544620 541536 536270
268503E39248L563K605K767J2550N849Q615J0849K2336J0689J5688L7758L4356G44683
$$ 539248 542811 545416 548183 560733 566582 575197 586046 608382 619071 634759 672517 706873 744683
252633G69411M0685K9515M5309M2437L7333L2120L5472J9782K6592L9246J1646A168795
$$ 769411 810096 839611 884920 927357 964690 996810 1032282 1052064 1078656 1117902 1129548 1168795
237803A145663l6270n9562o8016n3873n3340l8289m0895j1381j6221j3400M733G69094
$$ 1145663 1109393 1049831 981815 927942 874602 836313 795418 784037 767816 754416 759149 769094
222882G81111M0896J7285M0522K6751K5313J595K4464M5948P4876O9613N7169A226443
$$ 781111 822007 839292 879814 906565 931878 933473 957937 1003885 1078761 1148374 1205543 1226443
207870A233250l2917l0101o2221o3390n9297m2704n7434l6908l6801j5474k7867G71114
$$ 1233250 1200333 1170232 1108011 1044621 985324 942620 885186 848278 811477 796003 768136 771114
192766G56277j116O593J9676K9302K8985J8506M5841L5631J8453L2600j8772J7550I93832
$$ 756277 755161 761754 781430 810732 839717 858223 904064 939695 958148 990748 971976 989526 993832
176395I65223J0687J649j0051o433K391N585m840J2126l2334L510m200k502q773I32144
$$ 965223 975910 977559 967508 961075 963466 969051 964211 976337 944003 947513 943313 940811 932038 932144
158735I14488l3716j4358l6271p763m787K14M413m413l458r891j9676L244k5793G59840
$$ 914488 880772 866414 830143 822380 817593 817807 822220 817807 814349 804458 784782 788026 762233 759840
140949G53672P657J2498J5688K4036J3243K2814R412o593p446K0261o168q668H64180
$$ 753672 761329 773827 789515 813551 826794 849608 859020 852427 844981 865242 859074 850406 864180
124234H77686L406K0261M8074K7972L3824K3612J3880J7868N850n902m627l618A048130
$$ 877686 881092 901353 949427 977399 1011223 1034835 1048715 1066583 1072433 1066531 1061904 1058286 1048130
107408A051268P552N637r999J1274n31k4517m679j4943j1223j221L084m468J489A012871
$$ 1051268 1058820 1064457 1054458 1065732 1065201 1040684 1036005 1021062 1009839 1008618 1011702 1007234 1008723 1012871
89255A013881k3345j5688r679p99p551K7441R572L5632L5204K1964J1221L3877A183367
$$ 1013881 990536 974848 965169 964370 956819 984260 993832 1029464 1064668 1086632 1097853 1131730 1183367
72194A215647J0796o2381o6369A000427
$$ 1215647 1226443 1164062 1097693 1000427
66073I27890  $$checkpoint
##END=
##END=   $$end of all blocks