##TITLE= Raman spectrum of Pargasite (no. 5851) � http://rdrs.uaic.ro
##MINERAL= Pargasite
##CHEMISTRY= NaCa2(Mg,Fe++)4Al(Si6Al2)O22(OH)2
##JCAMP-DX= 5.01
##DATA TYPE= RAMAN SPECTRUM
##DATA CLASS= XYDATA
##ORIGIN= Department of Geology, UAIC, Romania
##OWNER= http://rdrs.uaic.ro � stud. Apopei Andrei Ionut
##LONGDATE= 2010/10/09 15:41:18.0889 +0200 $$ export date from JSpecView
##SPECTROGRAPHDATASYSTEM= HE 532 (Horiba Jobin-Yvon)
##XUNITS= Raman shift (1/cm)
##YUNITS= Intensity (cnt)
##XFACTOR= 3.188909E-3
##YFACTOR= 2.13523281E-4
##FIRSTX= 3399.61
##FIRSTY= 596.65485212
##LASTX= 210.701
##NPOINTS= 1024
##XYDATA= (X++(Y..Y))
1066073 2794332 2836930 2855292 2862603 2890287 2886096 2872522 2908869 2879077 2882392 2920969 2883781 2879321 2881429
1055229 2876385 2874995 2877311 2877566 2871888 2882648 2917606 2911684 2897769 2906262 2883781 2871303 2891433 2903021
1044320 2903740 2879321 2894662 2874959 2873107 2897221 2899329 2913524 2903569 2898610 2893565 2901558 2906810 2935213
1033344 2934665 2908991 2882562 2909540 2918739 2952516 2954867 2929913 2931679 2933617 2917777 2901510 2876969 2913439
1022299 2929913 2923650 2940587 2940550 2934921 2941342 2957231 2941050 2952808 2934787 2944912 2934921 2909576 2915754
1011189 2900206 2907980 2894784 2902813 2917557 2941013 2922894 2968405 2942146 2927476 2935676 2959912 2937894 2936054
1000013 2919994 2907724 2917521 2993237 2957731 2942219 2920299 2883147 2925709 2902399 2935164 2943316 2942731
989574 2926684 2928609 2961179 2956256 2940928 2951382 2939332 2940172 2941927 2967942 2927439 2933276 2943401 2931265
978266 2952942 2957097 2944876 2968526 2965919 2978993 2950883 2942682 2945083 2962056 2982941 2956890 2967734 2969245
966889 2948019 2946850 2966431 2955586 2949238 2948239 2943608 2955208 2951346 2978482 3002559 3002851 2976386 2972060 2989874
954621 2981516 2978153 2962982 2966894 2948068 2962982 2987815 2976678 3001511 2992226 2946216 2944742 2935128 2964164
943100 2962483 2992433 2990045 2970171 2981759 3000585 2987937 2970586 2987303 2979749 3014622 3011515 2998574 2965212
931510 2928316 2925928 2932983 2916631 2918398 2954660 2967978 2993944 2972694 2948738 2950249 2963738 2967479 2987986
919848 2999878 2982100 2958145 2949457 2967186 2989618 2961471 2962227 2980797 3005544 3004789 2988656 2972438 2985878
908113 2973571 2976215 2998611 3003692 3037054 3021969 3028951 3010796 2989826 2975460 2923954 2931935 2954490 2985926
896307 3008944 3043403 3032936 3012818 3022018 3003022 3052431 3025710 3058658 3031559 3036640 3063995 3042476
885278 3034459 3031181 3011344 3013574 3024955 3009163 2991129 3009955 2992896 3020129 3067102 3041758 3071391
874189 3057098 3012855 3003984 3015255 3019581 3025795 3024662 3038906 3041258 3051676 3025040 3023529 3027684 3043439
862176 3050080 3018655 3015584 3047229 3030255 3058780 3058146 3069831 3032010 3046717 3040161 3036092 3049203 3040844
850087 3044621 3016888 3003692 3042769 3064239 3050750 3049203 3083698 3058195 3034239 3043744 3031510 3031632
838795 3036762 3056087 3069405 3065628 3021214 3045206 3018826 3033277 3049836 3059328 3031632 3007396 3027355
827437 3054284 3053735 3069624 3087987 3066176 3050506 3082016 3077605 3050080 3071842 3034288 3048739 3017473 3065750
815135 3066846 3064287 3071087 3067309 3041599 3011929 3009577 3027940 3058402 3038821 3047180 2987145 2994078 3019325
802754 3034032 3009663 3028403 3034495 3004411 3027136 3067943 3071891 3064787 3037432 3063654 3023188 3022396 3057854
790299 3065750 3049787 3024455 3032058 3016681 3041465 3000841 2989363 3001426 3008907 3015633 3001218 3023273 3042062
777764 3033277 3051847 3045169 3058816 3018070 3026721 3002181 2992348 3018740 3027684 3058573 3055587 3064665 3062813
765155 3049495 3050592 3056891 3049458 3030669 3039540 3022774 3042476 3056599 3031096 3017644 3004155 3016340 3038529
752464 3077142 3075339 3080627 3070295 3071842 3070550 3056136 3081383 3085002 3078739 3103523 3124785 3113405 3114830
739695 3092934 3101305 3114111 3106094 3093275 3065676 3092057 3092690 3125967 3134752 3172184 3173781 3144878 3125541
726847 3123067 3121727 3075497 3105375 3102767 3091716 3125967 3118985 3116171 3084368 3098064 3096894 3082358 3099867
713918 3098234 3119668 3118571 3101597 3072683 3116085 3111516 3102438 3079287 3085928 3081212 3079701 3058658 3063824
700907 3103194 3075254 3083405 3090716 3106386 3106934 3079701 3069283 3073060 3087682 3093275 3079458 3059328 3048910
687815 3055843 3036347 3037347 3025003 3041465 3052395 3059450 3065506 3066347 3087390 3087475 3065713 3065835 3058658 3059828
673697 3069710 3083320 3068065 3071221 3079202 3065750 3059450 3064080 3053869 3086220 3073572 3072098 3103108 3079202
660436 3050458 3060632 3048155 3035080 3066761 3086135 3055880 3077934 3061936 3081346 3064202 3070246 3057939
648046 3059279 3018484 3012818 3035677 3092057 3070623 3035251 3016718 3038102 3031218 3021348 3025625 3036469 3029621
634621 3036433 3010333 3018996 2981674 2977348 2990130 2991507 2992896 2996345 2978786 2955586 2957146 2948616 2942902
621112 2948324 2948275 2960753 2963531 2930376 2958230 2963616 2947483 2978238 2990545 2977860 2957475 2971426 2975167
607518 2958657 2984537 2937857 2966601 2966760 2961934 2953783 2959497 2947934 2968149 2955586 2984659 2985000 2945424
593836 2949116 2939246 2947898 2949579 2932142 2962726 2967564 2978274 2931009 2938491 2926306 2914121 2944035 2941086
580070 2958608 2915583 2891384 2915961 2885462 2854878 2872315 2867221 2891591 2854951 2816386 2825878 2829119
567207 2867441 2884621 2875166 2881051 2895003 2881758 2875629 2882648 2871974 2861092 2878103 2851345 2857059 2865881
553271 2861092 2874069 2878736 2857851 2866929 2863529 2830837 2863822 2831349 2843229 2851381 2834322 2802556 2808442
539244 2820419 2824952 2833408 2809197 2808734 2827608 2837356 2847104 2815082 2810172 2822137 2836345 2830508 2830801 2861885
524120 2851381 2829327 2820968 2808113 2804701 2803824 2814205 2814705 2813072 2792687 2785839 2771046 2777943 2788105 2772094
508889 2765295 2747773 2738744 2748322 2739037 2719785 2707600 2696304 2677272 2677601 2669912 2713607 2701507 2695878
494580 2679416 2664953 2670046 2665550 2643654 2662686 2670290 2655960 2669705 2655339 2631554 2631895 2642520 2619077
480177 2604625 2618869 2600214 2619198 2611096 2598277 2570252 2577392 2590796 2590211 2587859 2583192 2588480 2594877
465683 2600665 2589699 2600507 2615628 2604284 2603906 2606136 2581633 2597692 2583948 2583570 2589662 2573700 2565329
451098 2542604 2539205 2537730 2542897 2561381 2527946 2508487 2504917 2485214 2508146 2521549 2498191 2485591 2500420
436416 2497399 2498239 2481851 2489332 2466181 2468862 2463062 2463525 2449999 2462014 2449037 2429785 2450670 2443822
421640 2430881 2436803 2448233 2428822 2443444 2423229 2425800 2441555 2442481 2430126 2420463 2410667 2431223 2412397
406769 2431722 2419537 2418952 2411678 2390757 2385590 2419793 2382983 2406512 2414164 2413823 2420719 2422986 2401552 2413701
390729 2413530 2424070 2413944 2391683 2413067 2402101 2398701 2392389 2370128 2368324 2330039 2351217 2363146 2343491
375658 2347939 2333951 2344710 2340835 2355043 2334743 2320633 2323825 2334328 2345173 2323191 2319036 2314114 2324203
360490 2293777 2309447 2281470 2288733 2299577 2295215 2314455 2300881 2278778 2291718 2312396 2317184 2334828 2345331
345222 2368617 2388405 2407986 2386467 2391049 2409290 2417734 2412726 2437096 2422852 2443785 2427774 2447855 2462477
329853 2485677 2525546 2526094 2529457 2520416 2555801 2556885 2584752 2574492 2597229 2583399 2585800 2606928 2601433
314387 2588030 2562941 2528104 2499787 2466936 2442981 2464743 2469410 2473784 2478695 2468484 2462854 2455921 2456433
298818 2455166 2437900 2420207 2407231 2407389 2435926 2455836 2467643 2509291 2500506 2496972 2501468 2517893 2513190
283147 2501298 2490088 2479999 2503442 2495875 2520708 2496509 2479743 2477525 2460929 2456299 2413104 2438022 2417137
267373 2384957 2395545 2388527 2412056 2413737 2422474 2436681 2444321 2475380 2484751 2484787 2500164 2541130 2577904 2596133
250357 2619710 2638780 2668230 2689615 2715045 2735674 2752440 2773313 2794916 2837600 2874289 2917313 2892517
235514 2861763 2827438 2767561 2731433 2725548 2676760 2666549 2638402 2636769 2633357 2608403 2626339 2630677 2680123
219426 2764113 2825208 2874069 2902472 2952601 3010040 3075497 3183699 3241175 3273233 3278778 3229027 3167773
204393 3108531 3015840 2943828 2869159 2758569 2678356 2612143 2557312 2542690 2509827 2477220 2489710 2455373
189267 2444577 2426007 2426812 2453996 2468155 2502687 2515505 2518064 2531382 2543067 2555752 2556093 2576759 2587725
172874 2588822 2647894 2642642 2634405 2654157 2616469 2625583 2604406 2569070 2549659 2566804 2542263 2505294 2478061
156371 2437522 2432685 2394912 2407523 2402515 2402442 2418904 2415967 2377390 2372979 2375172 2377146 2402893 2403904 2414286
138568 2429626 2432514 2440629 2437230 2457347 2487565 2503820 2503649 2505038 2498483 2487736 2492354 2480340 2496509 2543238
120638 2561552 2596596 2627898 2645420 2647272 2642691 2632309 2629117 2619540 2616969 2620624 2637683 2654206 2653146
103788 2685131 2692222 2715593 2713400 2710877 2716300 2733407 2732688 2828145 2856133 2872814 2850333 2853574 2794539
86824 2709793 2681853 2686508 2659494 2642691 2632480 2658775 2699034 2737221 2788154 2831885 2879833 3002815
70971 3023907 2995211 2876470 2741681
66073B675249  $$checkpoint
##END=